{"text_format":"1","workbook":"xlsx","n_sheets":4,"sheets":["Données","AGE","Visualisation","Liste déroulante"],"not_rendered":{"charts":0,"images":0,"macros":1,"external_links":0,"defined_names":18,"comments":1,"pivot_tables":0},"unopened":[],"bounds":{"document_bytes":16777216,"sheet_cells":100000,"rows_first":2000,"rows_last":500,"rows_between":2000,"halvings":0,"cell_chars":16384,"cell_head_chars":4096},"cells_cut":0,"cells_raw":0,"read":"whole","date_system":"1900"}

{"sheet":"Données","index":0,"n_rows":346,"n_cols":26,"rows_kept":346,"cut":false,"hidden":true,"merged":[]}
[null,null,null,null,"Distance officielle","Sur les épreuvesJeune : Natation : …………..1 min 50 au 100 m Vélo : .......... …….25 km/h Course à pied : ……5 min au km"]
[null,null,null,null,null,"Natation : ……………1 min 45 au 100 m Vélo route : ………….32 km/h Vélo (cross) : ……….15 km/h Course à pied : ……...4 min:30 au km Ski de fond : …………4 min 30 au km",null,null,null,null,null,null,null,null,{"$f":"K7/1000","v":5.0000000000000001E-3}]
[]
["Epreuve","Catégorie","Discipline",null,"Course",null,"Discipline","Distance","Marge\n Maxi","Marge\n Mini","Vitesse","Unité","Base de Temps (min / m)","Temps\nMoyen","Limite Haute 25%\n(min)","Limite Haute 40%\n(min)","Limite Basse\n(min)","Distance\nMoyenne","Limite Haute 25%\n(m)","Limite Haute 40%\n(m)","Limite Basse\n(m)","Age Mini","Age Maxi",null,"vérif distance basse épreuve assimilée / distance officielle","Vérif distance basse épreuve assimilée / distance base 10%"]
[10,10,1,{"$f":"CONCATENATE(A5,B5,C5)","v":"10101"},"Triathlon","Jeune 6-9","Natation",50,{"$f":"H5*1.1","v":55.000000000000007},{"$f":"H5*0.9","v":45},{"$f":"60+50","v":110},"Sec/100m",{"$f":"IF(L5=\"Sec/100m\",((K5)/60/100),(IF(L5=\"Km/h\",60/K5/1000,(IF(L5=\"Min/km\",K5/1000,\"\")))))","v":1.8333333333333333E-2},{"$f":"H5*M5","v":0.91666666666666663},{"$f":"N5*1.25","v":1.1458333333333333},{"$f":"N5*1.4","v":1.2833333333333332},{"$f":"O5*0.8","v":0.91666666666666663},{"$f":"(N5/M5)","v":50},{"$f":"O5/M5","v":62.499999999999993},{"$f":"P5/M5","v":70},{"$f":"+R5/2","v":25},{"$f":"VLOOKUP(F5,AGE!F:J,4,FALSE)","v":2015},{"$f":"VLOOKUP(F5,AGE!F:J,5,FALSE)","v":2012},null,{"$f":"IF(U5>R5,\"Attention dist basse assimilée > distance officielle\",)","v":0},{"$f":"IF(U5>J5,\"Attention dist basse assimilée > distance officielle tolérance 10%\",)","v":0}]
[10,10,2,{"$f":"CONCATENATE(A6,B6,C6)","v":"10102"},"Triathlon","Jeune 6-9","Cyclisme",1000,{"$f":"H6*1.1","v":1100},{"$f":"H6*0.9","v":900},25,"Km/h",{"$f":"IF(L6=\"Sec/100m\",((K6)/60/100),(IF(L6=\"Km/h\",60/K6/1000,(IF(L6=\"Min/km\",K6/1000,\"\")))))","v":2.3999999999999998E-3},{"$f":"H6*M6","v":2.4},{"$f":"N6*1.25","v":3},{"$f":"N6*1.4","v":3.36},{"$f":"O6*0.8","v":2.4000000000000004},{"$f":"N6/M6","v":1000},{"$f":"O6/M6","v":1250},{"$f":"P6/M6","v":1400},{"$f":"+R6/2","v":500},{"$f":"VLOOKUP(F6,AGE!F:J,4,FALSE)","v":2015},{"$f":"VLOOKUP(F6,AGE!F:J,5,FALSE)","v":2012},null,0,0]
[10,10,3,"10103","Triathlon","Jeune 6-9","Course à pied",500,550,450,5,"Min/km",5.0000000000000001E-3,2.5,3.125,3.5,{"$f":"O7*0.8","v":2.5},500,625,700,{"$f":"+R7/2","v":250},{"$f":"VLOOKUP(F7,AGE!F:J,4,FALSE)","v":2015},{"$f":"VLOOKUP(F7,AGE!F:J,5,FALSE)","v":2012},null,0,0]
[10,10,4,"10104","Triathlon","Jeune 6-9","Total",{"$f":"+SUM(H5:H7)","v":1550},{"$f":"SUM(I5:I7)","v":1705},{"$f":"SUM(J5:J7)","v":1395},null,null,"",{"$f":"SUM(N5:N7)","v":5.8166666666666664},{"$f":"SUM(O5:O7)","v":7.270833333333333},null,{"$f":"SUM(Q5:Q7)","v":5.8166666666666664},{"$f":"SUM(R5:R7)","v":1550},{"$f":"SUM(S5:S7)","v":1937.5},null,{"$f":"SUM(U5:U7)","v":775},{"$f":"VLOOKUP(F8,AGE!F:J,4,FALSE)","v":2015},{"$f":"VLOOKUP(F8,AGE!F:J,5,FALSE)","v":2012},null,0,0]
[10,20,1,"10201","Triathlon","Jeune 8-11","Natation",100,{"$f":"H9*1.1","v":110.00000000000001},{"$f":"H9*0.9","v":90},{"$f":"60+50","v":110},"Sec/100m",{"$f":"IF(L9=\"Sec/100m\",((K9)/60/100),(IF(L9=\"Km/h\",60/K9/1000,(IF(L9=\"Min/km\",K9/1000,\"\")))))","v":1.8333333333333333E-2},{"$f":"H9*M9","v":1.8333333333333333},{"$f":"N9*1.25","v":2.2916666666666665},{"$f":"N9*1.4","v":2.5666666666666664},{"$f":"O5","v":1.1458333333333333},{"$f":"N9/M9","v":100},{"$f":"O9/M9","v":124.99999999999999},{"$f":"P9/M9","v":140},{"$f":"IF(S5<J9,S5,J9)","v":62.499999999999993},{"$f":"VLOOKUP(F9,AGE!F:J,4,FALSE)","v":2013},{"$f":"VLOOKUP(F9,AGE!F:J,5,FALSE)","v":2010},null,0,0]
[10,20,2,"10202","Triathlon","Jeune 8-11","Cyclisme",2000,{"$f":"H10*1.1","v":2200},{"$f":"H10*0.9","v":1800},25,"Km/h",{"$f":"IF(L10=\"Sec/100m\",((K10)/60/100),(IF(L10=\"Km/h\",60/K10/1000,(IF(L10=\"Min/km\",K10/1000,\"\")))))","v":2.3999999999999998E-3},{"$f":"H10*M10","v":4.8},{"$f":"N10*1.25","v":6},{"$f":"N10*1.4","v":6.72},{"$f":"O6","v":3},{"$f":"N10/M10","v":2000},{"$f":"O10/M10","v":2500},{"$f":"P10/M10","v":2800},{"$f":"IF(S6<J10,S6,J10)","v":1250},{"$f":"VLOOKUP(F10,AGE!F:J,4,FALSE)","v":2013},{"$f":"VLOOKUP(F10,AGE!F:J,5,FALSE)","v":2010},null,0,0]
[10,20,3,"10203","Triathlon","Jeune 8-11","Course à pied",1000,1100,900,5,"Min/km",5.0000000000000001E-3,5,6.25,7,3.125,1000,1250,1400,625,{"$f":"VLOOKUP(F11,AGE!F:J,4,FALSE)","v":2013},{"$f":"VLOOKUP(F11,AGE!F:J,5,FALSE)","v":2010},null,0,0]
[10,20,4,"10204","Triathlon","Jeune 8-11","Total",{"$f":"+SUM(H9:H11)","v":3100},{"$f":"SUM(I9:I11)","v":3410},{"$f":"SUM(J9:J11)","v":2790},null,null,"",{"$f":"SUM(N9:N11)","v":11.633333333333333},{"$f":"SUM(O9:O11)","v":14.541666666666666},null,{"$f":"SUM(Q9:Q11)","v":7.270833333333333},{"$f":"SUM(R9:R11)","v":3100},{"$f":"SUM(S9:S11)","v":3875},null,{"$f":"SUM(U9:U11)","v":1937.5},{"$f":"VLOOKUP(F12,AGE!F:J,4,FALSE)","v":2013},{"$f":"VLOOKUP(F12,AGE!F:J,5,FALSE)","v":2010},null,0,0]
[10,30,1,"10301","Triathlon","Jeune 10-13","Natation",200,{"$f":"H13*1.1","v":220.00000000000003},{"$f":"H13*0.9","v":180},{"$f":"60+50","v":110},"Sec/100m",{"$f":"IF(L13=\"Sec/100m\",((K13)/60/100),(IF(L13=\"Km/h\",60/K13/1000,(IF(L13=\"Min/km\",K13/1000,\"\")))))","v":1.8333333333333333E-2},{"$f":"H13*M13","v":3.6666666666666665},{"$f":"N13*1.25","v":4.583333333333333},{"$f":"N13*1.4","v":5.1333333333333329},{"$f":"O9","v":2.2916666666666665},{"$f":"N13/M13","v":200},{"$f":"O13/M13","v":249.99999999999997},{"$f":"P13/M13","v":280},{"$f":"IF(S9<J13,S9,J13)","v":124.99999999999999},{"$f":"VLOOKUP(F13,AGE!F:J,4,FALSE)","v":2011},{"$f":"VLOOKUP(F13,AGE!F:J,5,FALSE)","v":2008},null,0,0]
[10,30,2,"10302","Triathlon","Jeune 10-13","Cyclisme",4000,{"$f":"H14*1.1","v":4400},{"$f":"H14*0.9","v":3600},25,"Km/h",{"$f":"IF(L14=\"Sec/100m\",((K14)/60/100),(IF(L14=\"Km/h\",60/K14/1000,(IF(L14=\"Min/km\",K14/1000,\"\")))))","v":2.3999999999999998E-3},{"$f":"H14*M14","v":9.6},{"$f":"N14*1.25","v":12},{"$f":"N14*1.4","v":13.44},{"$f":"O10","v":6},{"$f":"N14/M14","v":4000},{"$f":"O14/M14","v":5000},{"$f":"P14/M14","v":5600},{"$f":"IF(S10<J14,S10,J14)","v":2500},{"$f":"VLOOKUP(F14,AGE!F:J,4,FALSE)","v":2011},{"$f":"VLOOKUP(F14,AGE!F:J,5,FALSE)","v":2008},null,0,0]
[10,30,3,"10303","Triathlon","Jeune 10-13","Course à pied",1500,1650.0000000000002,1350,5,"Min/km",5.0000000000000001E-3,7.5,9.375,10.5,6.25,1500,1875,2100,1250,{"$f":"VLOOKUP(F15,AGE!F:J,4,FALSE)","v":2011},{"$f":"VLOOKUP(F15,AGE!F:J,5,FALSE)","v":2008},null,0,0]
[10,30,4,"10304","Triathlon","Jeune 10-13","Total",{"$f":"+SUM(H13:H15)","v":5700},{"$f":"SUM(I13:I15)","v":6270},{"$f":"SUM(J13:J15)","v":5130},null,null,"",{"$f":"SUM(N13:N15)","v":20.766666666666666},{"$f":"SUM(O13:O15)","v":25.958333333333332},null,{"$f":"SUM(Q13:Q15)","v":14.541666666666666},{"$f":"SUM(R13:R15)","v":5700},{"$f":"SUM(S13:S15)","v":7125},null,{"$f":"SUM(U13:U15)","v":3875},{"$f":"VLOOKUP(F16,AGE!F:J,4,FALSE)","v":2011},{"$f":"VLOOKUP(F16,AGE!F:J,5,FALSE)","v":2008},null,0,0]
[10,40,1,"10401","Triathlon","Jeune 12-19","Natation",300,{"$f":"H17*1.1","v":330},{"$f":"H17*0.9","v":270},{"$f":"60+50","v":110},"Sec/100m",{"$f":"IF(L17=\"Sec/100m\",((K17)/60/100),(IF(L17=\"Km/h\",60/K17/1000,(IF(L17=\"Min/km\",K17/1000,\"\")))))","v":1.8333333333333333E-2},{"$f":"H17*M17","v":5.5},{"$f":"N17*1.25","v":6.875},{"$f":"N17*1.4","v":7.6999999999999993},{"$f":"O13","v":4.583333333333333},{"$f":"N17/M17","v":300},{"$f":"O17/M17","v":375},{"$f":"P17/M17","v":419.99999999999994},{"$f":"IF(S13<J17,S13,J17)","v":249.99999999999997},{"$f":"VLOOKUP(F17,AGE!F:J,4,FALSE)","v":2009},{"$f":"VLOOKUP(F17,AGE!F:J,5,FALSE)","v":2002},null,0,0]
[10,40,2,"10402","Triathlon","Jeune 12-19","Cyclisme",6000,{"$f":"H18*1.1","v":6600.0000000000009},{"$f":"H18*0.9","v":5400},25,"Km/h",{"$f":"IF(L18=\"Sec/100m\",((K18)/60/100),(IF(L18=\"Km/h\",60/K18/1000,(IF(L18=\"Min/km\",K18/1000,\"\")))))","v":2.3999999999999998E-3},{"$f":"H18*M18","v":14.399999999999999},{"$f":"N18*1.25","v":18},{"$f":"N18*1.4","v":20.159999999999997},{"$f":"O14","v":12},{"$f":"N18/M18","v":6000},{"$f":"O18/M18","v":7500.0000000000009},{"$f":"P18/M18","v":8400},{"$f":"IF(S14<J18,S14,J18)","v":5000},{"$f":"VLOOKUP(F18,AGE!F:J,4,FALSE)","v":2009},{"$f":"VLOOKUP(F18,AGE!F:J,5,FALSE)","v":2002},null,0,0]
[10,40,3,"10403","Triathlon","Jeune 12-19","Course à pied",2000,2200,1800,5,"Min/km",5.0000000000000001E-3,10,12.5,14,9.375,2000,2500,2800,1800,{"$f":"VLOOKUP(F19,AGE!F:J,4,FALSE)","v":2009},{"$f":"VLOOKUP(F19,AGE!F:J,5,FALSE)","v":2002},null,0,0]
[10,40,4,"10404","Triathlon","Jeune 12-19","Total",{"$f":"+SUM(H17:H19)","v":8300},{"$f":"SUM(I17:I19)","v":9130},{"$f":"SUM(J17:J19)","v":7470},null,null,"",{"$f":"SUM(N17:N19)","v":29.9},{"$f":"SUM(O17:O19)","v":37.375},null,{"$f":"SUM(Q17:Q19)","v":25.958333333333332},{"$f":"SUM(R17:R19)","v":8300},{"$f":"SUM(S17:S19)","v":10375},null,{"$f":"SUM(U17:U19)","v":7050},{"$f":"VLOOKUP(F20,AGE!F:J,4,FALSE)","v":2009},{"$f":"VLOOKUP(F20,AGE!F:J,5,FALSE)","v":2002},null,0,0]
{"$rows_left_out":327}
{"sheet":"AGE","index":1,"n_rows":12,"n_cols":10,"rows_kept":12,"cut":false,"hidden":true,"merged":[]}
[null,"MOIS A PARTIR DUQUEL ON AFFICHE LES CATEGORIES D'AGE DE LA SAISON SUIVANTE :",null,"ANNEE AFFICHEE",null,"Course","Age atteint au cours de la saison mini","Age atteint au cours de la saison maxi","ANNEE mini","ANNEE maxi"]
[null,9,null,{"$f":"IF(MONTH(TODAY())>=B2,YEAR(TODAY())+1,YEAR(TODAY()))","v":2021},null,"Jeune 6-9",6,9,{"$f":"$D$2-G2","v":2015},{"$f":"$D$2-H2","v":2012}]
[null,null,null,null,null,"Jeune 8-11",8,11,{"$f":"$D$2-G3","v":2013},2010]
[null,null,null,null,null,"Jeune 10-13",10,13,2011,2008]
[null,null,null,null,null,"Jeune 12-19",12,19,2009,2002]
[null,null,null,null,null,"Distance XXS",12,99,2009,1922]
[null,null,null,null,null,"Distance XS",12,99,2009,1922]
[null,null,null,null,null,"Distance S",16,99,2005,1922]
[null,null,null,null,null,"Distance M",18,99,2003,1922]
[null,null,null,null,null,"Distance L",18,99,2003,1922]
[null,null,null,null,null,"Distance XL",18,99,2003,1922]
[null,null,null,null,null,"Distance XXL",18,99,2003,1922]

{"sheet":"Visualisation","index":2,"n_rows":23,"n_cols":20,"rows_kept":23,"cut":false,"hidden":false,"merged":[[0,2,0,3],[3,13,3,15],[3,10,3,12],[18,9,18,11],[3,2,3,9],[18,2,18,3],[10,11,10,12],[10,13,10,14],[11,11,11,12],[12,11,12,12],[13,11,13,12],[14,11,14,12],[11,13,11,14],[12,13,12,14],[13,13,13,14],[14,13,14,14]]}
["V 6",null,"Saisie case en Jaune",null,null,null,null,null,null,4,5,6,7,11,12,13,14,16,17,18]
[]
[]
[null,null,"Triathlon, Duathlon, Aquathlon, Swimrun \nDistances possibles ",null,null,null,null,null,null,null,"Epreuve Officielle",null,null,{"$f":"IF(OR(C12=\"Raid\",C12=\"Bike_and_Run\",C12=\"Swim_Run\"),\"\",\"Epreuve Assimilée\")","v":"Epreuve Assimilée"}]
[null,null,"Sélectionner la Compétition","Sélectionner le type d'épreuve",null,null,null,null,null,"Discipline","Distance Officielle","Tolérance Max +10%","Tolérance Min  -10%","Limite Haute 25%\n(distance)","Limite Haute 40% jeunes\n(Distance)","Limite Basse\n(distance)"]
[null,null,null,null,{"$f":"VLOOKUP(C6,'Liste déroulante'!$B$5:$C$16,2,FALSE)","v":{"$error":"#N/A"}},{"$f":"VLOOKUP(D6,'Liste déroulante'!E5:F15,2,FALSE)","v":{"$error":"#N/A"}},1,{"$f":"CONCATENATE(E6,F6,G6)","v":{"$error":"#N/A"}},{"$f":"IF(COUNTIF(Données!D:D,Visualisation!H6)>0, \"vrai\",\"faux\")","v":"faux"},{"$f":"IF($I6=\"FAUX\",\"\",VLOOKUP($H6,Données!$D$5:$U$346,$J$1,FALSE))","v":""},{"$f":"IF($I6=\"FAUX\",\"\",VLOOKUP($H6,Données!$D$5:$U$346,K1,FALSE))","v":""},{"$f":"IF($I6=\"FAUX\",\"\",VLOOKUP($H6,Données!$D$5:$U$346,L1,FALSE))","v":""},{"$f":"IF($I6=\"FAUX\",\"\",VLOOKUP($H6,Données!$D$5:$U$346,M1,FALSE))","v":""},{"$f":"IF($I6=\"FAUX\",\"\",VLOOKUP($H6,Données!$D$5:$U$346,R1,FALSE))","v":""},{"$f":"IF($I6=\"FAUX\",\"\",VLOOKUP($H6,Données!$D$5:$U$346,S1,FALSE))","v":""},{"$f":"IF($I6=\"FAUX\",\"\",VLOOKUP($H6,Données!$D$5:$U$346,T1,FALSE))","v":""}]
[null,null,null,null,null,null,2,{"$f":"CONCATENATE(E6,F6,G7)","v":{"$error":"#N/A"}},{"$f":"IF(COUNTIF(Données!D:D,Visualisation!H7)>0, \"vrai\",\"faux\")","v":"faux"},{"$f":"IF($I7=\"FAUX\",\"\",VLOOKUP($H7,Données!$D$5:$U$346,J1,FALSE))","v":""},{"$f":"IF($I7=\"FAUX\",\"\",VLOOKUP($H7,Données!$D$5:$U$346,K1,FALSE))","v":""},{"$f":"IF($I7=\"FAUX\",\"\",VLOOKUP($H7,Données!$D$5:$U$346,L1,FALSE))","v":""},{"$f":"IF($I7=\"FAUX\",\"\",VLOOKUP($H7,Données!$D$5:$U$346,M1,FALSE))","v":""},{"$f":"IF($I7=\"FAUX\",\"\",VLOOKUP($H7,Données!$D$5:$U$346,R1,FALSE))","v":""},{"$f":"IF($I7=\"FAUX\",\"\",VLOOKUP($H7,Données!$D$5:$U$346,S1,FALSE))","v":""},{"$f":"IF($I7=\"FAUX\",\"\",VLOOKUP($H7,Données!$D$5:$U$346,T1,FALSE))","v":""}]
[null,null,null,null,null,null,{"$f":"IF(OR(C6=\"Aquathlon\",C6=\"Cyclathlon_Vetathlon\",C6=\"Swim_Bike\"),\"\",3)","v":3},{"$f":"CONCATENATE(E6,F6,G8)","v":{"$error":"#N/A"}},{"$f":"IF(COUNTIF(Données!D:D,Visualisation!H8)>0, \"vrai\",\"faux\")","v":"faux"},{"$f":"IF($I8=\"FAUX\",\"\",VLOOKUP($H8,Données!$D$5:$U$346,J1,FALSE))","v":""},{"$f":"IF($I8=\"FAUX\",\"\",VLOOKUP($H8,Données!$D$5:$U$346,K1,FALSE))","v":""},{"$f":"IF($I8=\"FAUX\",\"\",VLOOKUP($H8,Données!$D$5:$U$346,L1,FALSE))","v":""},{"$f":"IF($I8=\"FAUX\",\"\",VLOOKUP($H8,Données!$D$5:$U$346,M1,FALSE))","v":""},{"$f":"IF($I8=\"FAUX\",\"\",VLOOKUP($H8,Données!$D$5:$U$346,R1,FALSE))","v":""},{"$f":"IF($I8=\"FAUX\",\"\",VLOOKUP($H8,Données!$D$5:$U$346,S1,FALSE))","v":""},{"$f":"IF($I8=\"FAUX\",\"\",VLOOKUP($H8,Données!$D$5:$U$346,T1,FALSE))","v":""}]
[null,null,null,null,null,null,4,{"$f":"CONCATENATE(E6,F6,G9)","v":{"$error":"#N/A"}},{"$f":"IF(COUNTIF(Données!D:D,Visualisation!H9)>0, \"vrai\",\"faux\")","v":"faux"},{"$f":"IF($I9=\"FAUX\",\"\",VLOOKUP($H9,Données!$D$5:$U$346,J1,FALSE))","v":""},{"$f":"IF($I9=\"FAUX\",\"\",VLOOKUP($H9,Données!$D$5:$U$346,K1,FALSE))","v":""},{"$f":"IF($I9=\"FAUX\",\"\",VLOOKUP($H9,Données!$D$5:$U$346,L1,FALSE))","v":""},{"$f":"IF($I9=\"FAUX\",\"\",VLOOKUP($H9,Données!$D$5:$U$346,M1,FALSE))","v":""},{"$f":"IF($I9=\"FAUX\",\"\",VLOOKUP($H9,Données!$D$5:$U$346,R1,FALSE))","v":""},{"$f":"IF($I9=\"FAUX\",\"\",VLOOKUP($H9,Données!$D$5:$U$346,S1,FALSE))","v":""},{"$f":"IF($I9=\"FAUX\",\"\",VLOOKUP($H9,Données!$D$5:$U$346,T1,FALSE))","v":""}]
[]
[null,null,"Contrôlez vos distances",null,null,null,null,null,null,"Discipline","Saisir les distances\n en mètre","Epreuve Officielle",null,{"$f":"IF(OR(C12=\"Raid\",C12=\"Bike and Run\",C12=\"Swim Run\"),\"\",\"Epreuve Assimilée\")","v":"Epreuve Assimilée"},null,null,{"$f":"CONCATENATE(\"Année de naissance saison \",AGE!D2)","v":"Année de naissance saison 2021"}]
[null,null,{"$f":"+C6","v":0},{"$f":"+D6","v":0},null,null,null,null,null,{"$f":"+J6","v":""},null,{"$f":"IF($K12=0,\"\",IF(AND($K12>=M6,$K12<=L6),\"Approuvé\",\"Refusé\"))","v":""},null,{"$f":"IF(K12=0,\"\",IF(O6=0,\"\",(IF(OR(K12>O6,K12<P6),\"Refusé\",\"Approuvé\"))))","v":""},null,null,"Mini"]
[null,null,null,null,null,null,null,null,null,{"$f":"+J7","v":""},null,{"$f":"IF($K13=0,\"\",IF(L7=\"\",\"\",IF(AND($K13>=M7,$K13<=L7),\"Approuvé\",\"Refusé\")))","v":""},null,{"$f":"IF(K13=0,\"\",IF(O7=\"\",\"\",IF(O7=0,\"\",(IF(OR(K13>O7,K13<P7),\"Refusé\",\"Approuvé\")))))","v":""},null,null,{"$f":"IF($I9=\"FAUX\",\"\",VLOOKUP($H9,Données!$D$5:$W$346,19,FALSE))","v":""}]
[null,null,null,null,null,null,null,null,null,{"$f":"+J8","v":""},null,{"$f":"IF($K14=0,\"\",IF(L8=\"\",\"\",IF(AND($K14>=M8,$K14<=L8),\"Approuvé\",\"Refusé\")))","v":""},null,{"$f":"IF(K14=0,\"\",IF(O8=\"\",\"\",IF(O8=0,\"\",(IF(OR(K14>O8,K14<P8),\"Refusé\",\"Approuvé\")))))","v":""},null,null,"Maxi"]
[null,null,null,null,null,null,null,null,null,null,{"$f":"IF(J14=\"\",SUM(K12:K13),SUM(K12:K14))","v":0},{"$f":"IF(L12=\"Refusé\",\"Refusé\",IF(L13=\"Refusé\",\"Refusé\",IF(L14=\"Refusé\",\"Refusé\",IF($K$15=0,\"\",IF(AND(K15>=M9,K15<=L9),\"Approuvé\",\"Refusé\")))))","v":""},null,{"$f":"IF(N12=\"Refusé\",\"Refusé\",IF(N13=\"Refusé\",\"Refusé\",IF(N14=\"Refusé\",\"Refusé\",IF($K$15=0,\"\",IF(AND(K15>=P9,K15<=N9),\"Approuvé\",IF(P9=\"\",\"\",\"Refusé\"))))))","v":""},null,null,{"$f":"IF($I9=\"FAUX\",\"\",VLOOKUP($H9,Données!$D$5:$W$346,20,FALSE))","v":""}]
[]
[]
[]
[null,null,"Bike&Run & Raid \nTemps estimé ",null,null,null,null,null,null,"Epreuve Officielle",null,null,null,{"$f":"CONCATENATE(\"Année de naissance saison \",AGE!D2)","v":"Année de naissance saison 2021"}]
[null,null,"Sélectionner la Compétition","Sélectionner le type d'épreuve",null,null,null,null,null,"Temps Moyen","Temps Max","Temps Min",null,"Mini"]
{"$rows_left_out":4}
{"sheet":"Liste déroulante","index":3,"n_rows":16,"n_cols":25,"rows_kept":16,"cut":false,"hidden":true,"merged":[]}
[null,"Distance officielle",null,null,null,null,null,null,null,null,null,null,null,null,null,null,null,null,null,null,null,null,null,null,"MOIS"]
[null,null,null,null,null,null,null,null,null,null,null,null,null,null,null,null,null,null,null,null,10,"Jeune 6-9",null,null,1]
[null,null,"colonne A de la page DONNEES",null,null,"colonne B de la page DONNEES",null,null,null,null,null,null,null,null,null,null,null,null,null,null,20,"Jeune 8-11",null,null,2]
[null,"Type d'épreuve",null,null,"Catégorie d'âge",null,null,null,null,null,null,null,null,null,null,null,null,null,null,null,30,"Jeunes 10-13",null,null,3]
[null,"Aquathlon",50,null,"Distance L",80,null,"Aquathlon","Jeune 6-9","Jeune 8-11","Jeune 10-13","Jeune 12-19","Distance XXS","Distance XS","Distance S","Distance M","Distance L","Distance XL",null,null,40,"Jeune 12-19",null,null,4]
[null,"Bike_and_Run",60,null,"Distance M",70,null,"Cross_Duathlon","Jeune 6-9","Jeune 8-11","Jeune 10-13","Jeune 12-19","Distance XXS","Distance XS","Distance S","Distance M","Distance L","Distance XL",null,null,41,"Distance XXS",null,null,5]
[null,"Cross_Duathlon",40,null,"Distance S",60,null,"Cross_Triathlon","Jeune 6-9","Jeune 8-11","Jeune 10-13","Jeune 12-19","Distance XXS","Distance XS","Distance S","Distance M","Distance L","Distance XL",null,null,50,"Distance XS",null,null,6]
[null,"Cross_Triathlon",20,null,"Distance XL",90,null,"Duathlon","Jeune 6-9","Jeune 8-11","Jeune 10-13","Jeune 12-19","Distance XXS","Distance XS","Distance S","Distance M","Distance L","Distance XL",null,null,60,"Distance S",null,null,7]
[null,"Duathlon",30,null,"Distance XS",50,null,"Duathlon_des_neiges","Distance XS","Distance S","Distance M",null,null,null,null,null,null,null,null,null,70,"Distance M",null,null,8]
[null,"Duathlon_des_neiges",80,null,"Distance XXL",91,null,"Triathlon","Jeune 6-9","Jeune 8-11","Jeune 10-13","Jeune 12-19","Distance XXS","Distance XS","Distance S","Distance M","Distance L","Distance XL","Distance XXL",null,80,"Distance L",null,null,9]
[null,"Raid",90,null,"Jeune 10-13",30,null,"Triathon_des_neiges","Distance XS","Distance S","Distance M",null,null,null,null,null,null,null,null,null,90,"Distance XL",null,null,10]
[null,"Swim_Run",91,null,"Jeune 12-19",40,null,"Swim_Run","Distance XXS","Distance XS","Distance S","Distance M","Distance L","Distance XL",null,null,null,null,null,null,91,"Distance XXL",null,null,11]
[null,"Triathlon",10,null,"Jeune 6-9",10,null,"Cyclathlon_Vetathlon","Jeune 6-9","Jeune 8-11","Jeune 10-13","Jeune 12-19","Distance XXS","Distance XS","Distance S","Distance M","Distance L","Distance XL",null,null,91,"Distance XXL",null,null,12]
[null,"Triathon_des_neiges",70,null,"Jeune 8-11",20,null,"Swim_Bike","Jeune 6-9","Jeune 8-11","Jeune 10-13","Jeune 12-19","Distance XXS","Distance XS","Distance S","Distance M","Distance L","Distance XL"]
[null,"Cyclathlon_Vetathlon",92,null,"Distance XXS",41,null,"Bike_and_Run","Jeune 6-9","Jeune 8-11","Jeune 10-13","Jeune 12-19","Distance XXS","Distance XS","Distance S","Distance M","Distance L"]
[null,"Swim_Bike",93,null,null,null,null,"Raid","Jeune 6-9","Jeune 8-11","Jeune 10-13","Jeune 12-19","Distance XXS","Distance XS","Distance S","Distance M","Distance L","Distance XL","Distance XXL"]