{"text_format":"1","workbook":"xlsx","n_sheets":4,"sheets":["Données","AGE","Visualisation","Liste déroulante"],"not_rendered":{"charts":0,"images":0,"macros":1,"external_links":0,"defined_names":18,"comments":1,"pivot_tables":0},"unopened":[],"bounds":{"document_bytes":16777216,"sheet_cells":100000,"rows_first":2000,"rows_last":500,"rows_between":2000,"halvings":0,"cell_chars":16384,"cell_head_chars":4096},"cells_cut":0,"cells_raw":0,"read":"whole","date_system":"1900"}

{"sheet":"Données","index":0,"n_rows":346,"n_cols":26,"rows_kept":346,"cut":false,"hidden":true,"merged":[]}
[null,null,null,null,"Distance officielle","Sur les épreuvesJeune : Natation : …………..1 min 50 au 100 m Vélo : .......... …….25 km/h Course à pied : ……5 min au km"]
[null,null,null,null,null,"Natation : ……………1 min 45 au 100 m Vélo route : ………….32 km/h Vélo (cross) : ……….15 km/h Course à pied : ……...4 min:30 au km Ski de fond : …………4 min 30 au km",null,null,null,null,null,null,null,null,{"$f":"K7/1000","v":5.0000000000000001E-3}]
[]
["Epreuve","Catégorie","Discipline",null,"Course",null,"Discipline","Distance","Marge\n Maxi","Marge\n Mini","Vitesse","Unité","Base de Temps (min / m)","Temps\nMoyen","Limite Haute 25%\n(min)","Limite Haute 40%\n(min)","Limite Basse\n(min)","Distance\nMoyenne","Limite Haute 25%\n(m)","Limite Haute 40%\n(m)","Limite Basse\n(m)","Age Mini","Age Maxi",null,"vérif distance basse épreuve assimilée / distance officielle","Vérif distance basse épreuve assimilée / distance base 10%"]
[10,10,1,{"$f":"CONCATENATE(A5,B5,C5)","v":"10101"},"Triathlon","Jeune 6-9","Natation",50,{"$f":"H5*1.1","v":55.000000000000007},{"$f":"H5*0.9","v":45},{"$f":"60+50","v":110},"Sec/100m",{"$f":"IF(L5=\"Sec/100m\",((K5)/60/100),(IF(L5=\"Km/h\",60/K5/1000,(IF(L5=\"Min/km\",K5/1000,\"\")))))","v":1.8333333333333333E-2},{"$f":"H5*M5","v":0.91666666666666663},{"$f":"N5*1.25","v":1.1458333333333333},{"$f":"N5*1.4","v":1.2833333333333332},{"$f":"O5*0.8","v":0.91666666666666663},{"$f":"(N5/M5)","v":50},{"$f":"O5/M5","v":62.499999999999993},{"$f":"P5/M5","v":70},{"$f":"+R5/2","v":25},{"$f":"VLOOKUP(F5,AGE!F:J,4,FALSE)","v":2015},{"$f":"VLOOKUP(F5,AGE!F:J,5,FALSE)","v":2012},null,{"$f":"IF(U5>R5,\"Attention dist basse assimilée > distance officielle\",)","v":0},{"$f":"IF(U5>J5,\"Attention dist basse assimilée > distance officielle tolérance 10%\",)","v":0}]
[10,10,2,{"$f":"CONCATENATE(A6,B6,C6)","v":"10102"},"Triathlon","Jeune 6-9","Cyclisme",1000,{"$f":"H6*1.1","v":1100},{"$f":"H6*0.9","v":900},25,"Km/h",{"$f":"IF(L6=\"Sec/100m\",((K6)/60/100),(IF(L6=\"Km/h\",60/K6/1000,(IF(L6=\"Min/km\",K6/1000,\"\")))))","v":2.3999999999999998E-3},{"$f":"H6*M6","v":2.4},{"$f":"N6*1.25","v":3},{"$f":"N6*1.4","v":3.36},{"$f":"O6*0.8","v":2.4000000000000004},{"$f":"N6/M6","v":1000},{"$f":"O6/M6","v":1250},{"$f":"P6/M6","v":1400},{"$f":"+R6/2","v":500},{"$f":"VLOOKUP(F6,AGE!F:J,4,FALSE)","v":2015},{"$f":"VLOOKUP(F6,AGE!F:J,5,FALSE)","v":2012},null,0,0]
[10,10,3,"10103","Triathlon","Jeune 6-9","Course à pied",500,550,450,5,"Min/km",5.0000000000000001E-3,2.5,3.125,3.5,{"$f":"O7*0.8","v":2.5},500,625,700,{"$f":"+R7/2","v":250},{"$f":"VLOOKUP(F7,AGE!F:J,4,FALSE)","v":2015},{"$f":"VLOOKUP(F7,AGE!F:J,5,FALSE)","v":2012},null,0,0]
[10,10,4,"10104","Triathlon","Jeune 6-9","Total",{"$f":"+SUM(H5:H7)","v":1550},{"$f":"SUM(I5:I7)","v":1705},{"$f":"SUM(J5:J7)","v":1395},null,null,"",{"$f":"SUM(N5:N7)","v":5.8166666666666664},{"$f":"SUM(O5:O7)","v":7.270833333333333},null,{"$f":"SUM(Q5:Q7)","v":5.8166666666666664},{"$f":"SUM(R5:R7)","v":1550},{"$f":"SUM(S5:S7)","v":1937.5},null,{"$f":"SUM(U5:U7)","v":775},{"$f":"VLOOKUP(F8,AGE!F:J,4,FALSE)","v":2015},{"$f":"VLOOKUP(F8,AGE!F:J,5,FALSE)","v":2012},null,0,0]
[10,20,1,"10201","Triathlon","Jeune 8-11","Natation",100,{"$f":"H9*1.1","v":110.00000000000001},{"$f":"H9*0.9","v":90},{"$f":"60+50","v":110},"Sec/100m",{"$f":"IF(L9=\"Sec/100m\",((K9)/60/100),(IF(L9=\"Km/h\",60/K9/1000,(IF(L9=\"Min/km\",K9/1000,\"\")))))","v":1.8333333333333333E-2},{"$f":"H9*M9","v":1.8333333333333333},{"$f":"N9*1.25","v":2.2916666666666665},{"$f":"N9*1.4","v":2.5666666666666664},{"$f":"O5","v":1.1458333333333333},{"$f":"N9/M9","v":100},{"$f":"O9/M9","v":124.99999999999999},{"$f":"P9/M9","v":140},{"$f":"IF(S5<J9,S5,J9)","v":62.499999999999993},{"$f":"VLOOKUP(F9,AGE!F:J,4,FALSE)","v":2013},{"$f":"VLOOKUP(F9,AGE!F:J,5,FALSE)","v":2010},null,0,0]
[10,20,2,"10202","Triathlon","Jeune 8-11","Cyclisme",2000,{"$f":"H10*1.1","v":2200},{"$f":"H10*0.9","v":1800},25,"Km/h",{"$f":"IF(L10=\"Sec/100m\",((K10)/60/100),(IF(L10=\"Km/h\",60/K10/1000,(IF(L10=\"Min/km\",K10/1000,\"\")))))","v":2.3999999999999998E-3},{"$f":"H10*M10","v":4.8},{"$f":"N10*1.25","v":6},{"$f":"N10*1.4","v":6.72},{"$f":"O6","v":3},{"$f":"N10/M10","v":2000},{"$f":"O10/M10","v":2500},{"$f":"P10/M10","v":2800},{"$f":"IF(S6<J10,S6,J10)","v":1250},{"$f":"VLOOKUP(F10,AGE!F:J,4,FALSE)","v":2013},{"$f":"VLOOKUP(F10,AGE!F:J,5,FALSE)","v":2010},null,0,0]
[10,20,3,"10203","Triathlon","Jeune 8-11","Course à pied",1000,1100,900,5,"Min/km",5.0000000000000001E-3,5,6.25,7,3.125,1000,1250,1400,625,{"$f":"VLOOKUP(F11,AGE!F:J,4,FALSE)","v":2013},{"$f":"VLOOKUP(F11,AGE!F:J,5,FALSE)","v":2010},null,0,0]
[10,20,4,"10204","Triathlon","Jeune 8-11","Total",{"$f":"+SUM(H9:H11)","v":3100},{"$f":"SUM(I9:I11)","v":3410},{"$f":"SUM(J9:J11)","v":2790},null,null,"",{"$f":"SUM(N9:N11)","v":11.633333333333333},{"$f":"SUM(O9:O11)","v":14.541666666666666},null,{"$f":"SUM(Q9:Q11)","v":7.270833333333333},{"$f":"SUM(R9:R11)","v":3100},{"$f":"SUM(S9:S11)","v":3875},null,{"$f":"SUM(U9:U11)","v":1937.5},{"$f":"VLOOKUP(F12,AGE!F:J,4,FALSE)","v":2013},{"$f":"VLOOKUP(F12,AGE!F:J,5,FALSE)","v":2010},null,0,0]
[10,30,1,"10301","Triathlon","Jeune 10-13","Natation",200,{"$f":"H13*1.1","v":220.00000000000003},{"$f":"H13*0.9","v":180},{"$f":"60+50","v":110},"Sec/100m",{"$f":"IF(L13=\"Sec/100m\",((K13)/60/100),(IF(L13=\"Km/h\",60/K13/1000,(IF(L13=\"Min/km\",K13/1000,\"\")))))","v":1.8333333333333333E-2},{"$f":"H13*M13","v":3.6666666666666665},{"$f":"N13*1.25","v":4.583333333333333},{"$f":"N13*1.4","v":5.1333333333333329},{"$f":"O9","v":2.2916666666666665},{"$f":"N13/M13","v":200},{"$f":"O13/M13","v":249.99999999999997},{"$f":"P13/M13","v":280},{"$f":"IF(S9<J13,S9,J13)","v":124.99999999999999},{"$f":"VLOOKUP(F13,AGE!F:J,4,FALSE)","v":2011},{"$f":"VLOOKUP(F13,AGE!F:J,5,FALSE)","v":2008},null,0,0]
[10,30,2,"10302","Triathlon","Jeune 10-13","Cyclisme",4000,{"$f":"H14*1.1","v":4400},{"$f":"H14*0.9","v":3600},25,"Km/h",{"$f":"IF(L14=\"Sec/100m\",((K14)/60/100),(IF(L14=\"Km/h\",60/K14/1000,(IF(L14=\"Min/km\",K14/1000,\"\")))))","v":2.3999999999999998E-3},{"$f":"H14*M14","v":9.6},{"$f":"N14*1.25","v":12},{"$f":"N14*1.4","v":13.44},{"$f":"O10","v":6},{"$f":"N14/M14","v":4000},{"$f":"O14/M14","v":5000},{"$f":"P14/M14","v":5600},{"$f":"IF(S10<J14,S10,J14)","v":2500},{"$f":"VLOOKUP(F14,AGE!F:J,4,FALSE)","v":2011},{"$f":"VLOOKUP(F14,AGE!F:J,5,FALSE)","v":2008},null,0,0]
[10,30,3,"10303","Triathlon","Jeune 10-13","Course à pied",1500,1650.0000000000002,1350,5,"Min/km",5.0000000000000001E-3,7.5,9.375,10.5,6.25,1500,1875,2100,1250,{"$f":"VLOOKUP(F15,AGE!F:J,4,FALSE)","v":2011},{"$f":"VLOOKUP(F15,AGE!F:J,5,FALSE)","v":2008},null,0,0]
[10,30,4,"10304","Triathlon","Jeune 10-13","Total",{"$f":"+SUM(H13:H15)","v":5700},{"$f":"SUM(I13:I15)","v":6270},{"$f":"SUM(J13:J15)","v":5130},null,null,"",{"$f":"SUM(N13:N15)","v":20.766666666666666},{"$f":"SUM(O13:O15)","v":25.958333333333332},null,{"$f":"SUM(Q13:Q15)","v":14.541666666666666},{"$f":"SUM(R13:R15)","v":5700},{"$f":"SUM(S13:S15)","v":7125},null,{"$f":"SUM(U13:U15)","v":3875},{"$f":"VLOOKUP(F16,AGE!F:J,4,FALSE)","v":2011},{"$f":"VLOOKUP(F16,AGE!F:J,5,FALSE)","v":2008},null,0,0]
[10,40,1,"10401","Triathlon","Jeune 12-19","Natation",300,{"$f":"H17*1.1","v":330},{"$f":"H17*0.9","v":270},{"$f":"60+50","v":110},"Sec/100m",{"$f":"IF(L17=\"Sec/100m\",((K17)/60/100),(IF(L17=\"Km/h\",60/K17/1000,(IF(L17=\"Min/km\",K17/1000,\"\")))))","v":1.8333333333333333E-2},{"$f":"H17*M17","v":5.5},{"$f":"N17*1.25","v":6.875},{"$f":"N17*1.4","v":7.6999999999999993},{"$f":"O13","v":4.583333333333333},{"$f":"N17/M17","v":300},{"$f":"O17/M17","v":375},{"$f":"P17/M17","v":419.99999999999994},{"$f":"IF(S13<J17,S13,J17)","v":249.99999999999997},{"$f":"VLOOKUP(F17,AGE!F:J,4,FALSE)","v":2009},{"$f":"VLOOKUP(F17,AGE!F:J,5,FALSE)","v":2002},null,0,0]
[10,40,2,"10402","Triathlon","Jeune 12-19","Cyclisme",6000,{"$f":"H18*1.1","v":6600.0000000000009},{"$f":"H18*0.9","v":5400},25,"Km/h",{"$f":"IF(L18=\"Sec/100m\",((K18)/60/100),(IF(L18=\"Km/h\",60/K18/1000,(IF(L18=\"Min/km\",K18/1000,\"\")))))","v":2.3999999999999998E-3},{"$f":"H18*M18","v":14.399999999999999},{"$f":"N18*1.25","v":18},{"$f":"N18*1.4","v":20.159999999999997},{"$f":"O14","v":12},{"$f":"N18/M18","v":6000},{"$f":"O18/M18","v":7500.0000000000009},{"$f":"P18/M18","v":8400},{"$f":"IF(S14<J18,S14,J18)","v":5000},{"$f":"VLOOKUP(F18,AGE!F:J,4,FALSE)","v":2009},{"$f":"VLOOKUP(F18,AGE!F:J,5,FALSE)","v":2002},null,0,0]
[10,40,3,"10403","Triathlon","Jeune 12-19","Course à pied",2000,2200,1800,5,"Min/km",5.0000000000000001E-3,10,12.5,14,9.375,2000,2500,2800,1800,{"$f":"VLOOKUP(F19,AGE!F:J,4,FALSE)","v":2009},{"$f":"VLOOKUP(F19,AGE!F:J,5,FALSE)","v":2002},null,0,0]
[10,40,4,"10404","Triathlon","Jeune 12-19","Total",{"$f":"+SUM(H17:H19)","v":8300},{"$f":"SUM(I17:I19)","v":9130},{"$f":"SUM(J17:J19)","v":7470},null,null,"",{"$f":"SUM(N17:N19)","v":29.9},{"$f":"SUM(O17:O19)","v":37.375},null,{"$f":"SUM(Q17:Q19)","v":25.958333333333332},{"$f":"SUM(R17:R19)","v":8300},{"$f":"SUM(S17:S19)","v":10375},null,{"$f":"SUM(U17:U19)","v":7050},{"$f":"VLOOKUP(F20,AGE!F:J,4,FALSE)","v":2009},{"$f":"VLOOKUP(F20,AGE!F:J,5,FALSE)","v":2002},null,0,0]
[10,41,1,"10411","Triathlon","Distance XXS","Natation",250,{"$f":"H21*1.1","v":275},{"$f":"H21*0.9","v":225},105,"Sec/100m",{"$f":"IF(L21=\"Sec/100m\",((K21)/60/100),(IF(L21=\"Km/h\",60/K21/1000,(IF(L21=\"Min/km\",K21/1000,\"\")))))","v":1.7500000000000002E-2},{"$f":"H21*M21","v":4.375},{"$f":"N21*1.25","v":5.46875},{"$f":"N21*1.4","v":6.125},{"$f":"O13","v":4.583333333333333},{"$f":"N21/M21","v":249.99999999999997},{"$f":"O21/M21","v":312.49999999999994},{"$f":"P21/M21","v":349.99999999999994},{"$f":"(N21*0.5)/M21","v":124.99999999999999},{"$f":"VLOOKUP(F21,AGE!F:J,4,FALSE)","v":2009},{"$f":"VLOOKUP(F21,AGE!F:J,5,FALSE)","v":1922},null,0,0]
[10,41,2,"10412","Triathlon","Distance XXS","Cyclisme",7500,{"$f":"H22*1.1","v":8250},{"$f":"H22*0.9","v":6750},32,"Km/h",{"$f":"IF(L22=\"Sec/100m\",((K22)/60/100),(IF(L22=\"Km/h\",60/K22/1000,(IF(L22=\"Min/km\",K22/1000,\"\")))))","v":1.8749999999999999E-3},{"$f":"H22*M22","v":14.0625},{"$f":"N22*1.25","v":17.578125},19.6875,{"$f":"O14","v":12},{"$f":"N22/M22","v":7500},{"$f":"O22/M22","v":9375},{"$f":"P22/M22","v":10500},{"$f":"(N22*0.5)/M22","v":3750},{"$f":"VLOOKUP(F22,AGE!F:J,4,FALSE)","v":2009},{"$f":"VLOOKUP(F22,AGE!F:J,5,FALSE)","v":1922},null,0,0]
[10,41,3,"10413","Triathlon","Distance XXS","Course à pied",1750,1925.0000000000002,1575,4.5,"Min/km",4.4999999999999997E-3,7.8749999999999991,9.8437499999999982,11.024999999999999,{"$f":"O15","v":9.375},1750,{"$f":"O23/M23","v":2187.4999999999995},{"$f":"P23/M23","v":2450},{"$f":"(N23*0.5)/M23","v":875},{"$f":"VLOOKUP(F23,AGE!F:J,4,FALSE)","v":2009},{"$f":"VLOOKUP(F23,AGE!F:J,5,FALSE)","v":1922},null,0,0]
[10,41,4,"10414","Triathlon","Distance XXS","Total",{"$f":"+SUM(H21:H23)","v":9500},{"$f":"SUM(I21:I23)","v":10450},{"$f":"SUM(J21:J23)","v":8550},null,null,"",{"$f":"SUM(N21:N23)","v":26.3125},{"$f":"SUM(O21:O23)","v":32.890625},null,{"$f":"SUM(Q21:Q23)","v":25.958333333333332},{"$f":"SUM(R21:R23)","v":9500},{"$f":"SUM(S21:S23)","v":11875},null,{"$f":"SUM(U21:U23)","v":4750},{"$f":"VLOOKUP(F24,AGE!F:J,4,FALSE)","v":2009},{"$f":"VLOOKUP(F24,AGE!F:J,5,FALSE)","v":1922},null,0,0]
[10,50,1,"10501","Triathlon","Distance XS","Natation",400,{"$f":"H25*1.1","v":440.00000000000006},{"$f":"H25*0.9","v":360},105,"Sec/100m",{"$f":"IF(L25=\"Sec/100m\",((K25)/60/100),(IF(L25=\"Km/h\",60/K25/1000,(IF(L25=\"Min/km\",K25/1000,\"\")))))","v":1.7500000000000002E-2},{"$f":"H25*M25","v":7.0000000000000009},{"$f":"N25*1.25","v":8.7500000000000018},9.8000000000000007,{"$f":"O17","v":6.875},{"$f":"N25/M25","v":400},{"$f":"O25/M25","v":500.00000000000006},{"$f":"P25/M25","v":560},{"$f":"IF(S21<J25,S21,J25)","v":312.49999999999994},{"$f":"VLOOKUP(F25,AGE!F:J,4,FALSE)","v":2009},{"$f":"VLOOKUP(F25,AGE!F:J,5,FALSE)","v":1922},null,0,0]
[10,50,2,"10502","Triathlon","Distance XS","Cyclisme",10000,{"$f":"H26*1.1","v":11000},{"$f":"H26*0.9","v":9000},32,"Km/h",{"$f":"IF(L26=\"Sec/100m\",((K26)/60/100),(IF(L26=\"Km/h\",60/K26/1000,(IF(L26=\"Min/km\",K26/1000,\"\")))))","v":1.8749999999999999E-3},{"$f":"H26*M26","v":18.75},{"$f":"N26*1.25","v":23.4375},26.25,{"$f":"O18","v":18},{"$f":"N26/M26","v":10000},{"$f":"O26/M26","v":12500},{"$f":"P26/M26","v":14000},{"$f":"IF(S22<J26,S22,J26)","v":9000},{"$f":"VLOOKUP(F26,AGE!F:J,4,FALSE)","v":2009},{"$f":"VLOOKUP(F26,AGE!F:J,5,FALSE)","v":1922},null,0,0]
[10,50,3,"10503","Triathlon","Distance XS","Course à pied",2500,2750,2250,4.5,"Min/km",4.4999999999999997E-3,11.25,14.0625,15.749999999999998,{"$f":"O19","v":12.5},2500,{"$f":"O27/M27","v":3125.0000000000005},{"$f":"P27/M27","v":3500},2187.4999999999995,{"$f":"VLOOKUP(F27,AGE!F:J,4,FALSE)","v":2009},{"$f":"VLOOKUP(F27,AGE!F:J,5,FALSE)","v":1922},null,0,0]
[10,50,4,"10504","Triathlon","Distance XS","Total",{"$f":"+SUM(H25:H27)","v":12900},{"$f":"SUM(I25:I27)","v":14190},{"$f":"SUM(J25:J27)","v":11610},null,null,"",{"$f":"SUM(N25:N27)","v":37},{"$f":"SUM(O25:O27)","v":46.25},null,{"$f":"SUM(Q25:Q27)","v":37.375},{"$f":"SUM(R25:R27)","v":12900},{"$f":"SUM(S25:S27)","v":16125},null,{"$f":"SUM(U25:U27)","v":11500},{"$f":"VLOOKUP(F28,AGE!F:J,4,FALSE)","v":2009},{"$f":"VLOOKUP(F28,AGE!F:J,5,FALSE)","v":1922},null,0,0]
[10,60,1,"10601","Triathlon","Distance S","Natation",750,{"$f":"H29*1.1","v":825.00000000000011},{"$f":"H29*0.9","v":675},105,"Sec/100m",{"$f":"IF(L29=\"Sec/100m\",((K29)/60/100),(IF(L29=\"Km/h\",60/K29/1000,(IF(L29=\"Min/km\",K29/1000,\"\")))))","v":1.7500000000000002E-2},{"$f":"H29*M29","v":13.125000000000002},{"$f":"N29*1.25","v":16.406250000000004},18.375,{"$f":"O25","v":8.7500000000000018},{"$f":"N29/M29","v":750},{"$f":"O29/M29","v":937.50000000000011},{"$f":"P29/M29","v":1050},{"$f":"IF(S25<J29,S25,J29)","v":500.00000000000006},{"$f":"VLOOKUP(F29,AGE!F:J,4,FALSE)","v":2005},{"$f":"VLOOKUP(F29,AGE!F:J,5,FALSE)","v":1922},null,0,0]
[10,60,2,"10602","Triathlon","Distance S","Cyclisme",20000,{"$f":"H30*1.1","v":22000},{"$f":"H30*0.9","v":18000},32,"Km/h",{"$f":"IF(L30=\"Sec/100m\",((K30)/60/100),(IF(L30=\"Km/h\",60/K30/1000,(IF(L30=\"Min/km\",K30/1000,\"\")))))","v":1.8749999999999999E-3},{"$f":"H30*M30","v":37.5},{"$f":"N30*1.25","v":46.875},52.5,{"$f":"O26","v":23.4375},{"$f":"N30/M30","v":20000},{"$f":"O30/M30","v":25000},{"$f":"P30/M30","v":28000},{"$f":"IF(S26<J30,S26,J30)","v":12500},{"$f":"VLOOKUP(F30,AGE!F:J,4,FALSE)","v":2005},{"$f":"VLOOKUP(F30,AGE!F:J,5,FALSE)","v":1922},null,0,0]
[10,60,3,"10603","Triathlon","Distance S","Course à pied",5000,5500,4500,4.5,"Min/km",4.4999999999999997E-3,22.5,28.125,31.499999999999996,{"$f":"O27","v":14.0625},5000,{"$f":"O31/M31","v":6250.0000000000009},{"$f":"P31/M31","v":7000},3125.0000000000005,{"$f":"VLOOKUP(F31,AGE!F:J,4,FALSE)","v":2005},{"$f":"VLOOKUP(F31,AGE!F:J,5,FALSE)","v":1922},null,0,0]
[10,60,4,"10604","Triathlon","Distance S","Total",{"$f":"+SUM(H29:H31)","v":25750},{"$f":"SUM(I29:I31)","v":28325},{"$f":"SUM(J29:J31)","v":23175},null,null,"",{"$f":"SUM(N29:N31)","v":73.125},{"$f":"SUM(O29:O31)","v":91.40625},null,{"$f":"SUM(Q29:Q31)","v":46.25},{"$f":"SUM(R29:R31)","v":25750},{"$f":"SUM(S29:S31)","v":32187.5},null,{"$f":"SUM(U29:U31)","v":16125},{"$f":"VLOOKUP(F32,AGE!F:J,4,FALSE)","v":2005},{"$f":"VLOOKUP(F32,AGE!F:J,5,FALSE)","v":1922},null,0,0]
[10,70,1,"10701","Triathlon","Distance M","Natation",1500,{"$f":"H33*1.1","v":1650.0000000000002},{"$f":"H33*0.9","v":1350},105,"Sec/100m",{"$f":"IF(L33=\"Sec/100m\",((K33)/60/100),(IF(L33=\"Km/h\",60/K33/1000,(IF(L33=\"Min/km\",K33/1000,\"\")))))","v":1.7500000000000002E-2},{"$f":"H33*M33","v":26.250000000000004},{"$f":"N33*1.25","v":32.812500000000007},36.75,{"$f":"O29","v":16.406250000000004},{"$f":"N33/M33","v":1500},{"$f":"O33/M33","v":1875.0000000000002},{"$f":"P33/M33","v":2100},{"$f":"IF(S29<J33,S29,J33)","v":937.50000000000011},{"$f":"VLOOKUP(F33,AGE!F:J,4,FALSE)","v":2003},{"$f":"VLOOKUP(F33,AGE!F:J,5,FALSE)","v":1922},null,0,0]
[10,70,2,"10702","Triathlon","Distance M","Cyclisme",40000,{"$f":"H34*1.1","v":44000},{"$f":"H34*0.9","v":36000},32,"Km/h",{"$f":"IF(L34=\"Sec/100m\",((K34)/60/100),(IF(L34=\"Km/h\",60/K34/1000,(IF(L34=\"Min/km\",K34/1000,\"\")))))","v":1.8749999999999999E-3},{"$f":"H34*M34","v":75},{"$f":"N34*1.25","v":93.75},105,{"$f":"O30","v":46.875},{"$f":"N34/M34","v":40000},{"$f":"O34/M34","v":50000},{"$f":"P34/M34","v":56000},{"$f":"IF(S30<J34,S30,J34)","v":25000},{"$f":"VLOOKUP(F34,AGE!F:J,4,FALSE)","v":2003},{"$f":"VLOOKUP(F34,AGE!F:J,5,FALSE)","v":1922},null,0,0]
[10,70,3,"10703","Triathlon","Distance M","Course à pied",10000,11000,9000,4.5,"Min/km",4.4999999999999997E-3,45,56.25,62.999999999999993,28.125,10000,12500.000000000002,14000,6250.0000000000009,{"$f":"VLOOKUP(F35,AGE!F:J,4,FALSE)","v":2003},{"$f":"VLOOKUP(F35,AGE!F:J,5,FALSE)","v":1922},null,0,0]
[10,70,4,"10704","Triathlon","Distance M","Total",{"$f":"+SUM(H33:H35)","v":51500},{"$f":"SUM(I33:I35)","v":56650},{"$f":"SUM(J33:J35)","v":46350},null,null,"",{"$f":"SUM(N33:N35)","v":146.25},{"$f":"SUM(O33:O35)","v":182.8125},null,{"$f":"SUM(Q33:Q35)","v":91.40625},{"$f":"SUM(R33:R35)","v":51500},{"$f":"SUM(S33:S35)","v":64375},null,{"$f":"SUM(U33:U35)","v":32187.5},{"$f":"VLOOKUP(F36,AGE!F:J,4,FALSE)","v":2003},{"$f":"VLOOKUP(F36,AGE!F:J,5,FALSE)","v":1922},null,0,0]
[10,80,1,"10801","Triathlon","Distance L","Natation",3000,{"$f":"H37*1.1","v":3300.0000000000005},{"$f":"H37*0.9","v":2700},105,"Sec/100m",{"$f":"IF(L37=\"Sec/100m\",((K37)/60/100),(IF(L37=\"Km/h\",60/K37/1000,(IF(L37=\"Min/km\",K37/1000,\"\")))))","v":1.7500000000000002E-2},{"$f":"H37*M37","v":52.500000000000007},{"$f":"N37*1.25","v":65.625000000000014},null,{"$f":"O33","v":32.812500000000007},{"$f":"N37/M37","v":3000},{"$f":"O37/M37","v":3750.0000000000005},{"$f":"P37/M37","v":0},{"$f":"IF(S33<J37,S33,J37)","v":1875.0000000000002},{"$f":"VLOOKUP(F37,AGE!F:J,4,FALSE)","v":2003},{"$f":"VLOOKUP(F37,AGE!F:J,5,FALSE)","v":1922},null,0,0]
[10,80,2,"10802","Triathlon","Distance L","Cyclisme",80000,{"$f":"H38*1.1","v":88000},{"$f":"H38*0.9","v":72000},32,"Km/h",{"$f":"IF(L38=\"Sec/100m\",((K38)/60/100),(IF(L38=\"Km/h\",60/K38/1000,(IF(L38=\"Min/km\",K38/1000,\"\")))))","v":1.8749999999999999E-3},{"$f":"H38*M38","v":150},{"$f":"N38*1.25","v":187.5},null,{"$f":"O34","v":93.75},{"$f":"N38/M38","v":80000},{"$f":"O38/M38","v":100000},{"$f":"P38/M38","v":0},{"$f":"IF(S34<J38,S34,J38)","v":50000},{"$f":"VLOOKUP(F38,AGE!F:J,4,FALSE)","v":2003},{"$f":"VLOOKUP(F38,AGE!F:J,5,FALSE)","v":1922},null,0,0]
[10,80,3,"10803","Triathlon","Distance L","Course à pied",20000,22000,18000,4.5,"Min/km",4.4999999999999997E-3,90,112.5,null,56.25,20000,25000.000000000004,0,12500.000000000002,{"$f":"VLOOKUP(F39,AGE!F:J,4,FALSE)","v":2003},{"$f":"VLOOKUP(F39,AGE!F:J,5,FALSE)","v":1922},null,0,0]
[10,80,4,"10804","Triathlon","Distance L","Total",{"$f":"+SUM(H37:H39)","v":103000},{"$f":"SUM(I37:I39)","v":113300},{"$f":"SUM(J37:J39)","v":92700},null,null,"",{"$f":"SUM(N37:N39)","v":292.5},{"$f":"SUM(O37:O39)","v":365.625},null,{"$f":"SUM(Q37:Q39)","v":182.8125},{"$f":"SUM(R37:R39)","v":103000},{"$f":"SUM(S37:S39)","v":128750},null,{"$f":"SUM(U37:U39)","v":64375},{"$f":"VLOOKUP(F40,AGE!F:J,4,FALSE)","v":2003},{"$f":"VLOOKUP(F40,AGE!F:J,5,FALSE)","v":1922},null,0,0]
[10,90,1,"10901","Triathlon","Distance XL","Natation",4000,{"$f":"H41*1.1","v":4400},{"$f":"H41*0.9","v":3600},105,"Sec/100m",{"$f":"IF(L41=\"Sec/100m\",((K41)/60/100),(IF(L41=\"Km/h\",60/K41/1000,(IF(L41=\"Min/km\",K41/1000,\"\")))))","v":1.7500000000000002E-2},{"$f":"H41*M41","v":70},{"$f":"N41*1.25","v":87.5},null,{"$f":"O37","v":65.625000000000014},{"$f":"N41/M41","v":3999.9999999999995},{"$f":"O41/M41","v":4999.9999999999991},{"$f":"P41/M41","v":0},{"$f":"(N41*0.75)/M41","v":2999.9999999999995},{"$f":"VLOOKUP(F41,AGE!F:J,4,FALSE)","v":2003},{"$f":"VLOOKUP(F41,AGE!F:J,5,FALSE)","v":1922},null,0,0]
[10,90,2,"10902","Triathlon","Distance XL","Cyclisme",120000,{"$f":"H42*1.1","v":132000},{"$f":"H42*0.9","v":108000},32,"Km/h",{"$f":"IF(L42=\"Sec/100m\",((K42)/60/100),(IF(L42=\"Km/h\",60/K42/1000,(IF(L42=\"Min/km\",K42/1000,\"\")))))","v":1.8749999999999999E-3},{"$f":"H42*M42","v":225},{"$f":"N42*1.25","v":281.25},null,{"$f":"O38","v":187.5},{"$f":"N42/M42","v":120000},{"$f":"O42/M42","v":150000},{"$f":"P42/M42","v":0},{"$f":"(N42*0.75)/M42","v":90000},{"$f":"VLOOKUP(F42,AGE!F:J,4,FALSE)","v":2003},{"$f":"VLOOKUP(F42,AGE!F:J,5,FALSE)","v":1922},null,0,0]
[10,90,3,"10903","Triathlon","Distance XL","Course à pied",30000,33000,27000,4.5,"Min/km",4.4999999999999997E-3,135,168.75,null,112.5,30000.000000000004,37500,0,22500,{"$f":"VLOOKUP(F43,AGE!F:J,4,FALSE)","v":2003},{"$f":"VLOOKUP(F43,AGE!F:J,5,FALSE)","v":1922},null,0,0]
[10,90,4,"10904","Triathlon","Distance XL","Total",{"$f":"+SUM(H41:H43)","v":154000},{"$f":"SUM(I41:I43)","v":169400},{"$f":"SUM(J41:J43)","v":138600},null,null,"",{"$f":"SUM(N41:N43)","v":430},{"$f":"SUM(O41:O43)","v":537.5},null,{"$f":"SUM(Q41:Q43)","v":365.625},{"$f":"SUM(R41:R43)","v":154000},{"$f":"SUM(S41:S43)","v":192500},null,{"$f":"SUM(U41:U43)","v":115500},{"$f":"VLOOKUP(F44,AGE!F:J,4,FALSE)","v":2003},{"$f":"VLOOKUP(F44,AGE!F:J,5,FALSE)","v":1922},null,0,0]
[10,91,1,"10911","Triathlon","Distance XXL","Natation",3800,{"$f":"H45*1.1","v":4180},{"$f":"H45*0.9","v":3420},105,"Sec/100m",{"$f":"IF(L45=\"Sec/100m\",((K45)/60/100),(IF(L45=\"Km/h\",60/K45/1000,(IF(L45=\"Min/km\",K45/1000,\"\")))))","v":1.7500000000000002E-2},{"$f":"H45*M45","v":66.5},{"$f":"N45*1.25","v":83.125},null,{"$f":"O41","v":87.5},{"$f":"N45/M45","v":3799.9999999999995},{"$f":"O45/M45","v":4750},{"$f":"P45/M45","v":0},{"$f":"(N45*0.75)/M45","v":2849.9999999999995},{"$f":"VLOOKUP(F45,AGE!F:J,4,FALSE)","v":2003},{"$f":"VLOOKUP(F45,AGE!F:J,5,FALSE)","v":1922},null,0,0]
[10,91,2,"10912","Triathlon","Distance XXL","Cyclisme",180000,{"$f":"H46*1.1","v":198000.00000000003},{"$f":"H46*0.9","v":162000},32,"Km/h",{"$f":"IF(L46=\"Sec/100m\",((K46)/60/100),(IF(L46=\"Km/h\",60/K46/1000,(IF(L46=\"Min/km\",K46/1000,\"\")))))","v":1.8749999999999999E-3},{"$f":"H46*M46","v":337.5},{"$f":"N46*1.25","v":421.875},null,{"$f":"O42","v":281.25},{"$f":"N46/M46","v":180000},{"$f":"O46/M46","v":225000},{"$f":"P46/M46","v":0},{"$f":"(N46*0.75)/M46","v":135000},{"$f":"VLOOKUP(F46,AGE!F:J,4,FALSE)","v":2003},{"$f":"VLOOKUP(F46,AGE!F:J,5,FALSE)","v":1922},null,0,0]
[10,91,3,"10913","Triathlon","Distance XXL","Course à pied",42195,46414.500000000007,37975.5,4.5,"Min/km",4.4999999999999997E-3,189.8775,237.34687500000001,null,168.75,42195,52743.750000000007,0,31646.25,{"$f":"VLOOKUP(F47,AGE!F:J,4,FALSE)","v":2003},{"$f":"VLOOKUP(F47,AGE!F:J,5,FALSE)","v":1922},null,0,0]
[10,91,4,"10914","Triathlon","Distance XXL","Total",{"$f":"+SUM(H45:H47)","v":225995},{"$f":"SUM(I45:I47)","v":248594.50000000003},{"$f":"SUM(J45:J47)","v":203395.5},null,null,"",{"$f":"SUM(N45:N47)","v":593.87750000000005},{"$f":"SUM(O45:O47)","v":742.34687499999995},null,{"$f":"SUM(Q45:Q47)","v":537.5},{"$f":"SUM(R45:R47)","v":225995},{"$f":"SUM(S45:S47)","v":282493.75},null,{"$f":"SUM(U45:U47)","v":169496.25},{"$f":"VLOOKUP(F48,AGE!F:J,4,FALSE)","v":2003},{"$f":"VLOOKUP(F48,AGE!F:J,5,FALSE)","v":1922},null,0,0]
[20,10,1,"20101","Cross Triathlon","Jeune 6-9","Natation",50,{"$f":"H49*1.1","v":55.000000000000007},{"$f":"H49*0.9","v":45},110,"Sec/100m",{"$f":"IF(L49=\"Sec/100m\",((K49)/60/100),(IF(L49=\"Km/h\",60/K49/1000,(IF(L49=\"Min/km\",K49/1000,\"\")))))","v":1.8333333333333333E-2},{"$f":"H49*M49","v":0.91666666666666663},{"$f":"N49*1.25","v":1.1458333333333333},{"$f":"N49*1.4","v":1.2833333333333332},{"$f":"O45","v":83.125},{"$f":"N49/M49","v":50},{"$f":"O49/M49","v":62.499999999999993},{"$f":"P49/M49","v":70},{"$f":"+R49/2","v":25},{"$f":"VLOOKUP(F49,AGE!F:J,4,FALSE)","v":2015},{"$f":"VLOOKUP(F49,AGE!F:J,5,FALSE)","v":2012},null,0,0]
[20,10,2,"20102","Cross Triathlon","Jeune 6-9","Cyclisme",1000,{"$f":"H50*1.1","v":1100},{"$f":"H50*0.9","v":900},15,"Km/h",{"$f":"IF(L50=\"Sec/100m\",((K50)/60/100),(IF(L50=\"Km/h\",60/K50/1000,(IF(L50=\"Min/km\",K50/1000,\"\")))))","v":4.0000000000000001E-3},{"$f":"H50*M50","v":4},{"$f":"N50*1.25","v":5},{"$f":"N50*1.4","v":5.6},{"$f":"O46","v":421.875},{"$f":"N50/M50","v":1000},{"$f":"O50/M50","v":1250},{"$f":"P50/M50","v":1399.9999999999998},{"$f":"+R50/2","v":500},{"$f":"VLOOKUP(F50,AGE!F:J,4,FALSE)","v":2015},{"$f":"VLOOKUP(F50,AGE!F:J,5,FALSE)","v":2012},null,0,0]
[20,10,3,"20103","Cross Triathlon","Jeune 6-9","Course à pied",500,550,450,5,"Min/km",5.0000000000000001E-3,2.5,3.125,3.5,237.34687500000001,500,625,700,{"$f":"+R51/2","v":250},{"$f":"VLOOKUP(F51,AGE!F:J,4,FALSE)","v":2015},{"$f":"VLOOKUP(F51,AGE!F:J,5,FALSE)","v":2012},null,0,0]
[20,10,4,"20104","Cross Triathlon","Jeune 6-9","Total",{"$f":"+SUM(H49:H51)","v":1550},{"$f":"SUM(I49:I51)","v":1705},{"$f":"SUM(J49:J51)","v":1395},null,null,"",{"$f":"SUM(N49:N51)","v":7.416666666666667},{"$f":"SUM(O49:O51)","v":9.2708333333333321},null,{"$f":"SUM(Q49:Q51)","v":742.34687499999995},{"$f":"SUM(R49:R51)","v":1550},{"$f":"SUM(S49:S51)","v":1937.5},null,{"$f":"SUM(U49:U51)","v":775},{"$f":"VLOOKUP(F52,AGE!F:J,4,FALSE)","v":2015},{"$f":"VLOOKUP(F52,AGE!F:J,5,FALSE)","v":2012},null,0,0]
[20,20,1,"20201","Cross Triathlon","Jeune 8-11","Natation",100,{"$f":"H53*1.1","v":110.00000000000001},{"$f":"H53*0.9","v":90},110,"Sec/100m",{"$f":"IF(L53=\"Sec/100m\",((K53)/60/100),(IF(L53=\"Km/h\",60/K53/1000,(IF(L53=\"Min/km\",K53/1000,\"\")))))","v":1.8333333333333333E-2},{"$f":"H53*M53","v":1.8333333333333333},{"$f":"N53*1.25","v":2.2916666666666665},{"$f":"N53*1.4","v":2.5666666666666664},{"$f":"O49","v":1.1458333333333333},{"$f":"N53/M53","v":100},{"$f":"O53/M53","v":124.99999999999999},{"$f":"P53/M53","v":140},{"$f":"IF(S49<J53,S49,J53)","v":62.499999999999993},{"$f":"VLOOKUP(F53,AGE!F:J,4,FALSE)","v":2013},{"$f":"VLOOKUP(F53,AGE!F:J,5,FALSE)","v":2010},null,0,0]
[20,20,2,"20202","Cross Triathlon","Jeune 8-11","Cyclisme",2000,{"$f":"H54*1.1","v":2200},{"$f":"H54*0.9","v":1800},15,"Km/h",{"$f":"IF(L54=\"Sec/100m\",((K54)/60/100),(IF(L54=\"Km/h\",60/K54/1000,(IF(L54=\"Min/km\",K54/1000,\"\")))))","v":4.0000000000000001E-3},{"$f":"H54*M54","v":8},{"$f":"N54*1.25","v":10},{"$f":"N54*1.4","v":11.2},{"$f":"O50","v":5},{"$f":"N54/M54","v":2000},{"$f":"O54/M54","v":2500},{"$f":"P54/M54","v":2799.9999999999995},{"$f":"IF(S50<J54,S50,J54)","v":1250},{"$f":"VLOOKUP(F54,AGE!F:J,4,FALSE)","v":2013},{"$f":"VLOOKUP(F54,AGE!F:J,5,FALSE)","v":2010},null,0,0]
[20,20,3,"20203","Cross Triathlon","Jeune 8-11","Course à pied",1000,1100,900,5,"Min/km",5.0000000000000001E-3,5,6.25,7,3.125,1000,1250,1400,625,{"$f":"VLOOKUP(F55,AGE!F:J,4,FALSE)","v":2013},{"$f":"VLOOKUP(F55,AGE!F:J,5,FALSE)","v":2010},null,0,0]
[20,20,4,"20204","Cross Triathlon","Jeune 8-11","Total",{"$f":"+SUM(H53:H55)","v":3100},{"$f":"SUM(I53:I55)","v":3410},{"$f":"SUM(J53:J55)","v":2790},null,null,"",{"$f":"SUM(N53:N55)","v":14.833333333333334},{"$f":"SUM(O53:O55)","v":18.541666666666664},null,{"$f":"SUM(Q53:Q55)","v":9.2708333333333321},{"$f":"SUM(R53:R55)","v":3100},{"$f":"SUM(S53:S55)","v":3875},null,{"$f":"SUM(U53:U55)","v":1937.5},{"$f":"VLOOKUP(F56,AGE!F:J,4,FALSE)","v":2013},{"$f":"VLOOKUP(F56,AGE!F:J,5,FALSE)","v":2010},null,0,0]
[20,30,1,"20301","Cross Triathlon","Jeune 10-13","Natation",200,{"$f":"H57*1.1","v":220.00000000000003},{"$f":"H57*0.9","v":180},110,"Sec/100m",{"$f":"IF(L57=\"Sec/100m\",((K57)/60/100),(IF(L57=\"Km/h\",60/K57/1000,(IF(L57=\"Min/km\",K57/1000,\"\")))))","v":1.8333333333333333E-2},{"$f":"H57*M57","v":3.6666666666666665},{"$f":"N57*1.25","v":4.583333333333333},{"$f":"N57*1.4","v":5.1333333333333329},{"$f":"O53","v":2.2916666666666665},{"$f":"N57/M57","v":200},{"$f":"O57/M57","v":249.99999999999997},{"$f":"P57/M57","v":280},{"$f":"IF(S53<J57,S53,J57)","v":124.99999999999999},{"$f":"VLOOKUP(F57,AGE!F:J,4,FALSE)","v":2011},{"$f":"VLOOKUP(F57,AGE!F:J,5,FALSE)","v":2008},null,0,0]
[20,30,2,"20302","Cross Triathlon","Jeune 10-13","Cyclisme",4000,{"$f":"H58*1.1","v":4400},{"$f":"H58*0.9","v":3600},15,"Km/h",{"$f":"IF(L58=\"Sec/100m\",((K58)/60/100),(IF(L58=\"Km/h\",60/K58/1000,(IF(L58=\"Min/km\",K58/1000,\"\")))))","v":4.0000000000000001E-3},{"$f":"H58*M58","v":16},{"$f":"N58*1.25","v":20},{"$f":"N58*1.4","v":22.4},{"$f":"O54","v":10},{"$f":"N58/M58","v":4000},{"$f":"O58/M58","v":5000},{"$f":"P58/M58","v":5599.9999999999991},{"$f":"IF(S54<J58,S54,J58)","v":2500},{"$f":"VLOOKUP(F58,AGE!F:J,4,FALSE)","v":2011},{"$f":"VLOOKUP(F58,AGE!F:J,5,FALSE)","v":2008},null,0,0]
[20,30,3,"20303","Cross Triathlon","Jeune 10-13","Course à pied",1500,1650.0000000000002,1350,5,"Min/km",5.0000000000000001E-3,7.5,9.375,10.5,6.25,1500,1875,2100,1250,{"$f":"VLOOKUP(F59,AGE!F:J,4,FALSE)","v":2011},{"$f":"VLOOKUP(F59,AGE!F:J,5,FALSE)","v":2008},null,0,0]
[20,30,4,"20304","Cross Triathlon","Jeune 10-13","Total",{"$f":"+SUM(H57:H59)","v":5700},{"$f":"SUM(I57:I59)","v":6270},{"$f":"SUM(J57:J59)","v":5130},null,null,"",{"$f":"SUM(N57:N59)","v":27.166666666666668},{"$f":"SUM(O57:O59)","v":33.958333333333329},null,{"$f":"SUM(Q57:Q59)","v":18.541666666666664},{"$f":"SUM(R57:R59)","v":5700},{"$f":"SUM(S57:S59)","v":7125},null,{"$f":"SUM(U57:U59)","v":3875},{"$f":"VLOOKUP(F60,AGE!F:J,4,FALSE)","v":2011},{"$f":"VLOOKUP(F60,AGE!F:J,5,FALSE)","v":2008},null,0,0]
[20,40,1,"20401","Cross Triathlon","Jeune 12-19","Natation",300,{"$f":"H61*1.1","v":330},{"$f":"H61*0.9","v":270},110,"Sec/100m",{"$f":"IF(L61=\"Sec/100m\",((K61)/60/100),(IF(L61=\"Km/h\",60/K61/1000,(IF(L61=\"Min/km\",K61/1000,\"\")))))","v":1.8333333333333333E-2},{"$f":"H61*M61","v":5.5},{"$f":"N61*1.25","v":6.875},{"$f":"N61*1.4","v":7.6999999999999993},{"$f":"O57","v":4.583333333333333},{"$f":"N61/M61","v":300},{"$f":"O61/M61","v":375},{"$f":"P61/M61","v":419.99999999999994},{"$f":"IF(S57<J61,S57,J61)","v":249.99999999999997},{"$f":"VLOOKUP(F61,AGE!F:J,4,FALSE)","v":2009},{"$f":"VLOOKUP(F61,AGE!F:J,5,FALSE)","v":2002},null,0,0]
[20,40,2,"20402","Cross Triathlon","Jeune 12-19","Cyclisme",6000,{"$f":"H62*1.1","v":6600.0000000000009},{"$f":"H62*0.9","v":5400},15,"Km/h",{"$f":"IF(L62=\"Sec/100m\",((K62)/60/100),(IF(L62=\"Km/h\",60/K62/1000,(IF(L62=\"Min/km\",K62/1000,\"\")))))","v":4.0000000000000001E-3},{"$f":"H62*M62","v":24},{"$f":"N62*1.25","v":30},{"$f":"N62*1.4","v":33.599999999999994},{"$f":"O58","v":20},{"$f":"N62/M62","v":6000},{"$f":"O62/M62","v":7500},{"$f":"P62/M62","v":8399.9999999999982},{"$f":"IF(S58<J62,S58,J62)","v":5000},{"$f":"VLOOKUP(F62,AGE!F:J,4,FALSE)","v":2009},{"$f":"VLOOKUP(F62,AGE!F:J,5,FALSE)","v":2002},null,0,0]
[20,40,3,"20403","Cross Triathlon","Jeune 12-19","Course à pied",2000,2200,1800,5,"Min/km",5.0000000000000001E-3,10,12.5,14,9.375,2000,2500,2800,1800,{"$f":"VLOOKUP(F63,AGE!F:J,4,FALSE)","v":2009},{"$f":"VLOOKUP(F63,AGE!F:J,5,FALSE)","v":2002},null,0,0]
[20,40,4,"20404","Cross Triathlon","Jeune 12-19","Total",{"$f":"+SUM(H61:H63)","v":8300},{"$f":"SUM(I61:I63)","v":9130},{"$f":"SUM(J61:J63)","v":7470},null,null,"",{"$f":"SUM(N61:N63)","v":39.5},{"$f":"SUM(O61:O63)","v":49.375},null,{"$f":"SUM(Q61:Q63)","v":33.958333333333329},{"$f":"SUM(R61:R63)","v":8300},{"$f":"SUM(S61:S63)","v":10375},null,{"$f":"SUM(U61:U63)","v":7050},{"$f":"VLOOKUP(F64,AGE!F:J,4,FALSE)","v":2009},{"$f":"VLOOKUP(F64,AGE!F:J,5,FALSE)","v":2002},null,0,0]
[20,41,1,"20411","Cross Triathlon","Distance XXS","Natation",250,{"$f":"H65*1.1","v":275},{"$f":"H65*0.9","v":225},105,"Sec/100m",{"$f":"IF(L65=\"Sec/100m\",((K65)/60/100),(IF(L65=\"Km/h\",60/K65/1000,(IF(L65=\"Min/km\",K65/1000,\"\")))))","v":1.7500000000000002E-2},{"$f":"H65*M65","v":4.375},{"$f":"N65*1.25","v":5.46875},{"$f":"N65*1.4","v":6.125},{"$f":"O57","v":4.583333333333333},{"$f":"N65/M65","v":249.99999999999997},{"$f":"O65/M65","v":312.49999999999994},{"$f":"P65/M65","v":349.99999999999994},{"$f":"(N65*0.5)/M65","v":124.99999999999999},{"$f":"VLOOKUP(F65,AGE!F:J,4,FALSE)","v":2009},{"$f":"VLOOKUP(F65,AGE!F:J,5,FALSE)","v":1922},null,{"$f":"IF(U65>R65,\"Attention dist basse assimilée > distance officielle\",)","v":0},{"$f":"IF(U65>J65,\"Attention dist basse assimilée > distance officielle tolérance 10%\",)","v":0}]
[20,41,2,"20412","Cross Triathlon","Distance XXS","Cyclisme",4000,{"$f":"H66*1.1","v":4400},{"$f":"H66*0.9","v":3600},15,"Km/h",{"$f":"IF(L66=\"Sec/100m\",((K66)/60/100),(IF(L66=\"Km/h\",60/K66/1000,(IF(L66=\"Min/km\",K66/1000,\"\")))))","v":4.0000000000000001E-3},{"$f":"H66*M66","v":16},{"$f":"N66*1.25","v":20},22.4,{"$f":"O58","v":20},{"$f":"N66/M66","v":4000},{"$f":"O66/M66","v":5000},{"$f":"P66/M66","v":5599.9999999999991},2000,{"$f":"VLOOKUP(F66,AGE!F:J,4,FALSE)","v":2009},{"$f":"VLOOKUP(F66,AGE!F:J,5,FALSE)","v":1922},null,0,0]
[20,41,3,"20413","Cross Triathlon","Distance XXS","Course à pied",1500,1650.0000000000002,1350,4.5,"Min/km",4.4999999999999997E-3,6.7499999999999991,8.4374999999999982,9.4499999999999975,{"$f":"O59","v":9.375},1500,1874.9999999999998,2099.9999999999995,750,{"$f":"VLOOKUP(F67,AGE!F:J,4,FALSE)","v":2009},{"$f":"VLOOKUP(F67,AGE!F:J,5,FALSE)","v":1922},null,0,0]
[20,41,4,"20414","Cross Triathlon","Distance XXS","Total",{"$f":"+SUM(H65:H67)","v":5750},{"$f":"SUM(I65:I67)","v":6325},{"$f":"SUM(J65:J67)","v":5175},null,null,"",{"$f":"SUM(N65:N67)","v":27.125},{"$f":"SUM(O65:O67)","v":33.90625},null,{"$f":"SUM(Q65:Q67)","v":33.958333333333329},{"$f":"SUM(R65:R67)","v":5750},{"$f":"SUM(S65:S67)","v":7187.5},null,{"$f":"SUM(U65:U67)","v":2875},{"$f":"VLOOKUP(F68,AGE!F:J,4,FALSE)","v":2009},{"$f":"VLOOKUP(F68,AGE!F:J,5,FALSE)","v":1922},null,0,0]
[20,50,1,"20501","Cross Triathlon","Distance XS","Natation",250,{"$f":"H69*1.1","v":275},{"$f":"H69*0.9","v":225},105,"Sec/100m",{"$f":"IF(L69=\"Sec/100m\",((K69)/60/100),(IF(L69=\"Km/h\",60/K69/1000,(IF(L69=\"Min/km\",K69/1000,\"\")))))","v":1.7500000000000002E-2},{"$f":"H69*M69","v":4.375},{"$f":"N69*1.25","v":5.46875},{"$f":"N69*1.4","v":6.125},{"$f":"O61","v":6.875},{"$f":"N69/M69","v":249.99999999999997},{"$f":"O69/M69","v":312.49999999999994},{"$f":"P69/M69","v":349.99999999999994},{"$f":"IF(S65<J69,S65,J69)","v":225},{"$f":"VLOOKUP(F69,AGE!F:J,4,FALSE)","v":2009},{"$f":"VLOOKUP(F69,AGE!F:J,5,FALSE)","v":1922},null,0,0]
[20,50,2,"20502","Cross Triathlon","Distance XS","Cyclisme",5500,{"$f":"H70*1.1","v":6050.0000000000009},{"$f":"H70*0.9","v":4950},15,"Km/h",{"$f":"IF(L70=\"Sec/100m\",((K70)/60/100),(IF(L70=\"Km/h\",60/K70/1000,(IF(L70=\"Min/km\",K70/1000,\"\")))))","v":4.0000000000000001E-3},{"$f":"H70*M70","v":22},{"$f":"N70*1.25","v":27.5},30.799999999999997,{"$f":"O62","v":30},{"$f":"N70/M70","v":5500},{"$f":"O70/M70","v":6875},{"$f":"P70/M70","v":7699.9999999999991},{"$f":"IF(S66<J70,S66,J70)","v":4950},{"$f":"VLOOKUP(F70,AGE!F:J,4,FALSE)","v":2009},{"$f":"VLOOKUP(F70,AGE!F:J,5,FALSE)","v":1922},null,0,0]
[20,50,3,"20503","Cross Triathlon","Distance XS","Course à pied",2000,2200,1800,4.5,"Min/km",4.4999999999999997E-3,9,11.25,12.6,{"$f":"O63","v":12.5},2000.0000000000002,2500,2800,1800,{"$f":"VLOOKUP(F71,AGE!F:J,4,FALSE)","v":2009},{"$f":"VLOOKUP(F71,AGE!F:J,5,FALSE)","v":1922},null,0,0]
[20,50,4,"20504","Cross Triathlon","Distance XS","Total",{"$f":"+SUM(H69:H71)","v":7750},{"$f":"SUM(I69:I71)","v":8525},{"$f":"SUM(J69:J71)","v":6975},null,null,"",{"$f":"SUM(N69:N71)","v":35.375},{"$f":"SUM(O69:O71)","v":44.21875},null,{"$f":"SUM(Q69:Q71)","v":49.375},{"$f":"SUM(R69:R71)","v":7750},{"$f":"SUM(S69:S71)","v":9687.5},null,{"$f":"SUM(U69:U71)","v":6975},{"$f":"VLOOKUP(F72,AGE!F:J,4,FALSE)","v":2009},{"$f":"VLOOKUP(F72,AGE!F:J,5,FALSE)","v":1922},null,0,0]
[20,60,1,"20601","Cross Triathlon","Distance S","Natation",500,{"$f":"H73*1.1","v":550},{"$f":"H73*0.9","v":450},105,"Sec/100m",{"$f":"IF(L73=\"Sec/100m\",((K73)/60/100),(IF(L73=\"Km/h\",60/K73/1000,(IF(L73=\"Min/km\",K73/1000,\"\")))))","v":1.7500000000000002E-2},{"$f":"H73*M73","v":8.75},{"$f":"N73*1.25","v":10.9375},{"$f":"N73*1.4","v":12.25},{"$f":"O69","v":5.46875},{"$f":"N73/M73","v":499.99999999999994},{"$f":"O73/M73","v":624.99999999999989},{"$f":"P73/M73","v":699.99999999999989},{"$f":"IF(S69<J73,S69,J73)","v":312.49999999999994},{"$f":"VLOOKUP(F73,AGE!F:J,4,FALSE)","v":2005},{"$f":"VLOOKUP(F73,AGE!F:J,5,FALSE)","v":1922},null,0,0]
[20,60,2,"20602","Cross Triathlon","Distance S","Cyclisme",11000,{"$f":"H74*1.1","v":12100.000000000002},{"$f":"H74*0.9","v":9900},15,"Km/h",{"$f":"IF(L74=\"Sec/100m\",((K74)/60/100),(IF(L74=\"Km/h\",60/K74/1000,(IF(L74=\"Min/km\",K74/1000,\"\")))))","v":4.0000000000000001E-3},{"$f":"H74*M74","v":44},{"$f":"N74*1.25","v":55},61.599999999999994,{"$f":"O70","v":27.5},{"$f":"N74/M74","v":11000},{"$f":"O74/M74","v":13750},{"$f":"P74/M74","v":15399.999999999998},{"$f":"IF(S70<J74,S70,J74)","v":6875},{"$f":"VLOOKUP(F74,AGE!F:J,4,FALSE)","v":2005},{"$f":"VLOOKUP(F74,AGE!F:J,5,FALSE)","v":1922},null,0,0]
[20,60,3,"20603","Cross Triathlon","Distance S","Course à pied",4000,4400,3600,4.5,"Min/km",4.4999999999999997E-3,18,22.5,25.2,11.25,4000.0000000000005,5000,5600,2500,{"$f":"VLOOKUP(F75,AGE!F:J,4,FALSE)","v":2005},{"$f":"VLOOKUP(F75,AGE!F:J,5,FALSE)","v":1922},null,0,0]
[20,60,4,"20604","Cross Triathlon","Distance S","Total",{"$f":"+SUM(H73:H75)","v":15500},{"$f":"SUM(I73:I75)","v":17050},{"$f":"SUM(J73:J75)","v":13950},null,null,"",{"$f":"SUM(N73:N75)","v":70.75},{"$f":"SUM(O73:O75)","v":88.4375},null,{"$f":"SUM(Q73:Q75)","v":44.21875},{"$f":"SUM(R73:R75)","v":15500},{"$f":"SUM(S73:S75)","v":19375},null,{"$f":"SUM(U73:U75)","v":9687.5},{"$f":"VLOOKUP(F76,AGE!F:J,4,FALSE)","v":2005},{"$f":"VLOOKUP(F76,AGE!F:J,5,FALSE)","v":1922},null,0,0]
[20,70,1,"20701","Cross Triathlon","Distance M","Natation",1000,{"$f":"H77*1.1","v":1100},{"$f":"H77*0.9","v":900},105,"Sec/100m",{"$f":"IF(L77=\"Sec/100m\",((K77)/60/100),(IF(L77=\"Km/h\",60/K77/1000,(IF(L77=\"Min/km\",K77/1000,\"\")))))","v":1.7500000000000002E-2},{"$f":"H77*M77","v":17.5},{"$f":"N77*1.25","v":21.875},{"$f":"N77*1.4","v":24.5},{"$f":"O73","v":10.9375},{"$f":"N77/M77","v":999.99999999999989},{"$f":"O77/M77","v":1249.9999999999998},{"$f":"P77/M77","v":1399.9999999999998},{"$f":"IF(S73<J77,S73,J77)","v":624.99999999999989},{"$f":"VLOOKUP(F77,AGE!F:J,4,FALSE)","v":2003},{"$f":"VLOOKUP(F77,AGE!F:J,5,FALSE)","v":1922},null,{"$f":"IF(U77>R77,\"Attention dist basse assimilée > distance officielle\",)","v":0},{"$f":"IF(U77>J77,\"Attention dist basse assimilée > distance officielle tolérance 10%\",)","v":0}]
[20,70,2,{"$f":"CONCATENATE(A78,B78,C78)","v":"20702"},"Cross Triathlon","Distance M","Cyclisme",22000,{"$f":"H78*1.1","v":24200.000000000004},{"$f":"H78*0.9","v":19800},15,"Km/h",{"$f":"IF(L78=\"Sec/100m\",((K78)/60/100),(IF(L78=\"Km/h\",60/K78/1000,(IF(L78=\"Min/km\",K78/1000,\"\")))))","v":4.0000000000000001E-3},{"$f":"H78*M78","v":88},{"$f":"N78*1.25","v":110},123.19999999999999,{"$f":"O74","v":55},{"$f":"N78/M78","v":22000},{"$f":"O78/M78","v":27500},{"$f":"P78/M78","v":30799.999999999996},{"$f":"IF(S74<J78,S74,J78)","v":13750},{"$f":"VLOOKUP(F78,AGE!F:J,4,FALSE)","v":2003},{"$f":"VLOOKUP(F78,AGE!F:J,5,FALSE)","v":1922},null,0,0]
[20,70,3,"20703","Cross Triathlon","Distance M","Course à pied",8000,8800,7200,4.5,"Min/km",4.4999999999999997E-3,36,45,50.4,22.5,8000.0000000000009,10000,11200,5000,{"$f":"VLOOKUP(F79,AGE!F:J,4,FALSE)","v":2003},{"$f":"VLOOKUP(F79,AGE!F:J,5,FALSE)","v":1922},null,0,0]
[20,70,4,"20704","Cross Triathlon","Distance M","Total",{"$f":"+SUM(H77:H79)","v":31000},{"$f":"SUM(I77:I79)","v":34100},{"$f":"SUM(J77:J79)","v":27900},null,null,"",{"$f":"SUM(N77:N79)","v":141.5},{"$f":"SUM(O77:O79)","v":176.875},null,{"$f":"SUM(Q77:Q79)","v":88.4375},{"$f":"SUM(R77:R79)","v":31000},{"$f":"SUM(S77:S79)","v":38750},null,{"$f":"SUM(U77:U79)","v":19375},{"$f":"VLOOKUP(F80,AGE!F:J,4,FALSE)","v":2003},{"$f":"VLOOKUP(F80,AGE!F:J,5,FALSE)","v":1922},null,0,0]
[20,80,1,"20801","Cross Triathlon","Distance L","Natation",2000,{"$f":"H81*1.1","v":2200},{"$f":"H81*0.9","v":1800},105,"Sec/100m",{"$f":"IF(L81=\"Sec/100m\",((K81)/60/100),(IF(L81=\"Km/h\",60/K81/1000,(IF(L81=\"Min/km\",K81/1000,\"\")))))","v":1.7500000000000002E-2},{"$f":"H81*M81","v":35},{"$f":"N81*1.25","v":43.75},null,{"$f":"O77","v":21.875},{"$f":"N81/M81","v":1999.9999999999998},{"$f":"O81/M81","v":2499.9999999999995},{"$f":"P81/M81","v":0},{"$f":"(N81*0.75)/M81","v":1499.9999999999998},{"$f":"VLOOKUP(F81,AGE!F:J,4,FALSE)","v":2003},{"$f":"VLOOKUP(F81,AGE!F:J,5,FALSE)","v":1922},null,0,0]
[20,80,2,"20802","Cross Triathlon","Distance L","Cyclisme",44000,{"$f":"H82*1.1","v":48400.000000000007},{"$f":"H82*0.9","v":39600},15,"Km/h",{"$f":"IF(L82=\"Sec/100m\",((K82)/60/100),(IF(L82=\"Km/h\",60/K82/1000,(IF(L82=\"Min/km\",K82/1000,\"\")))))","v":4.0000000000000001E-3},{"$f":"H82*M82","v":176},{"$f":"N82*1.25","v":220},null,{"$f":"O78","v":110},{"$f":"N82/M82","v":44000},{"$f":"O82/M82","v":55000},{"$f":"P82/M82","v":0},{"$f":"(N82*0.75)/M82","v":33000},{"$f":"VLOOKUP(F82,AGE!F:J,4,FALSE)","v":2003},{"$f":"VLOOKUP(F82,AGE!F:J,5,FALSE)","v":1922},null,0,0]
[20,80,3,"20803","Cross Triathlon","Distance L","Course à pied",16000,17600,14400,4.5,"Min/km",4.4999999999999997E-3,72,90,null,45,16000.000000000002,20000,0,12000,{"$f":"VLOOKUP(F83,AGE!F:J,4,FALSE)","v":2003},{"$f":"VLOOKUP(F83,AGE!F:J,5,FALSE)","v":1922},null,0,0]
[20,80,4,"20804","Cross Triathlon","Distance L","Total",{"$f":"+SUM(H81:H83)","v":62000},{"$f":"SUM(I81:I83)","v":68200},{"$f":"SUM(J81:J83)","v":55800},null,null,"",{"$f":"SUM(N81:N83)","v":283},{"$f":"SUM(O81:O83)","v":353.75},null,{"$f":"SUM(Q81:Q83)","v":176.875},{"$f":"SUM(R81:R83)","v":62000},{"$f":"SUM(S81:S83)","v":77500},null,{"$f":"SUM(U81:U83)","v":46500},{"$f":"VLOOKUP(F84,AGE!F:J,4,FALSE)","v":2003},{"$f":"VLOOKUP(F84,AGE!F:J,5,FALSE)","v":1922},null,0,0]
[20,90,1,"20901","Cross Triathlon","Distance XL","Natation",3000,{"$f":"H85*1.1","v":3300.0000000000005},{"$f":"H85*0.9","v":2700},105,"Sec/100m",{"$f":"IF(L85=\"Sec/100m\",((K85)/60/100),(IF(L85=\"Km/h\",60/K85/1000,(IF(L85=\"Min/km\",K85/1000,\"\")))))","v":1.7500000000000002E-2},{"$f":"H85*M85","v":52.500000000000007},{"$f":"N85*1.25","v":65.625000000000014},null,{"$f":"O81","v":43.75},{"$f":"N85/M85","v":3000},{"$f":"O85/M85","v":3750.0000000000005},{"$f":"P85/M85","v":0},{"$f":"(N85*0.75)/M85","v":2250},{"$f":"VLOOKUP(F85,AGE!F:J,4,FALSE)","v":2003},{"$f":"VLOOKUP(F85,AGE!F:J,5,FALSE)","v":1922},null,0,0]
[20,90,2,"20902","Cross Triathlon","Distance XL","Cyclisme",66000,{"$f":"H86*1.1","v":72600},{"$f":"H86*0.9","v":59400},15,"Km/h",{"$f":"IF(L86=\"Sec/100m\",((K86)/60/100),(IF(L86=\"Km/h\",60/K86/1000,(IF(L86=\"Min/km\",K86/1000,\"\")))))","v":4.0000000000000001E-3},{"$f":"H86*M86","v":264},{"$f":"N86*1.25","v":330},null,{"$f":"O82","v":220},{"$f":"N86/M86","v":66000},{"$f":"O86/M86","v":82500},{"$f":"P86/M86","v":0},{"$f":"(N86*0.75)/M86","v":49500},{"$f":"VLOOKUP(F86,AGE!F:J,4,FALSE)","v":2003},{"$f":"VLOOKUP(F86,AGE!F:J,5,FALSE)","v":1922},null,0,0]
[20,90,3,"20903","Cross Triathlon","Distance XL","Course à pied",24000,26400.000000000004,21600,4.5,"Min/km",4.4999999999999997E-3,107.99999999999999,134.99999999999997,null,90,24000,29999.999999999996,0,18000,{"$f":"VLOOKUP(F87,AGE!F:J,4,FALSE)","v":2003},{"$f":"VLOOKUP(F87,AGE!F:J,5,FALSE)","v":1922},null,0,0]
[20,90,4,"20904","Cross Triathlon","Distance XL","Total",{"$f":"+SUM(H85:H87)","v":93000},{"$f":"SUM(I85:I87)","v":102300},{"$f":"SUM(J85:J87)","v":83700},null,null,"",{"$f":"SUM(N85:N87)","v":424.5},{"$f":"SUM(O85:O87)","v":530.625},null,{"$f":"SUM(Q85:Q87)","v":353.75},{"$f":"SUM(R85:R87)","v":93000},{"$f":"SUM(S85:S87)","v":116250},null,{"$f":"SUM(U85:U87)","v":69750},{"$f":"VLOOKUP(F88,AGE!F:J,4,FALSE)","v":2003},{"$f":"VLOOKUP(F88,AGE!F:J,5,FALSE)","v":1922},null,0,0]
[30,10,1,"30101","Duathlon","Jeune 6-9","Course à pied",250,{"$f":"H89*1.1","v":275},{"$f":"H89*0.9","v":225},5,"Min/km",{"$f":"IF(L89=\"Sec/100m\",((K89)/60/100),(IF(L89=\"Km/h\",60/K89/1000,(IF(L89=\"Min/km\",K89/1000,\"\")))))","v":5.0000000000000001E-3},{"$f":"H89*M89","v":1.25},{"$f":"N89*1.25","v":1.5625},{"$f":"N89*1.4","v":1.75},{"$f":"O85","v":65.625000000000014},{"$f":"N89/M89","v":250},{"$f":"O89/M89","v":312.5},{"$f":"P89/M89","v":350},{"$f":"+R89/2","v":125},{"$f":"VLOOKUP(F89,AGE!F:J,4,FALSE)","v":2015},{"$f":"VLOOKUP(F89,AGE!F:J,5,FALSE)","v":2012},null,0,0]
[30,10,2,"30102","Duathlon","Jeune 6-9","Cyclisme",1000,{"$f":"H90*1.1","v":1100},{"$f":"H90*0.9","v":900},15,"Km/h",4.0000000000000001E-3,{"$f":"H90*M90","v":4},{"$f":"N90*1.25","v":5},{"$f":"N90*1.4","v":5.6},{"$f":"O86","v":330},{"$f":"N90/M90","v":1000},{"$f":"O90/M90","v":1250},{"$f":"P90/M90","v":1399.9999999999998},{"$f":"+R90/2","v":500},{"$f":"VLOOKUP(F90,AGE!F:J,4,FALSE)","v":2015},{"$f":"VLOOKUP(F90,AGE!F:J,5,FALSE)","v":2012},null,0,0]
[30,10,3,"30103","Duathlon","Jeune 6-9","Course à pied",250,275,225,5,"Min/km",5.0000000000000001E-3,1.25,1.5625,1.75,134.99999999999997,250,312.5,350,{"$f":"+R91/2","v":125},{"$f":"VLOOKUP(F91,AGE!F:J,4,FALSE)","v":2015},{"$f":"VLOOKUP(F91,AGE!F:J,5,FALSE)","v":2012},null,0,0]
[30,10,4,"30104","Duathlon","Jeune 6-9","Total",{"$f":"+SUM(H89:H91)","v":1500},{"$f":"SUM(I89:I91)","v":1650},{"$f":"SUM(J89:J91)","v":1350},null,null,"",{"$f":"SUM(N89:N91)","v":6.5},{"$f":"SUM(O89:O91)","v":8.125},null,{"$f":"SUM(Q89:Q91)","v":530.625},{"$f":"SUM(R89:R91)","v":1500},{"$f":"SUM(S89:S91)","v":1875},null,{"$f":"SUM(U89:U91)","v":750},{"$f":"VLOOKUP(F92,AGE!F:J,4,FALSE)","v":2015},{"$f":"VLOOKUP(F92,AGE!F:J,5,FALSE)","v":2012},null,0,0]
[30,20,1,"30201","Duathlon","Jeune 8-11","Course à pied",500,{"$f":"H93*1.1","v":550},{"$f":"H93*0.9","v":450},5,"Min/km",5.0000000000000001E-3,{"$f":"H93*M93","v":2.5},{"$f":"N93*1.25","v":3.125},{"$f":"N93*1.4","v":3.5},{"$f":"O89","v":1.5625},{"$f":"N93/M93","v":500},{"$f":"O93/M93","v":625},{"$f":"P93/M93","v":700},{"$f":"IF(S89<J93,S89,J93)","v":312.5},{"$f":"VLOOKUP(F93,AGE!F:J,4,FALSE)","v":2013},{"$f":"VLOOKUP(F93,AGE!F:J,5,FALSE)","v":2010},null,0,0]
[30,20,2,"30202","Duathlon","Jeune 8-11","Cyclisme",2000,{"$f":"H94*1.1","v":2200},{"$f":"H94*0.9","v":1800},15,"Km/h",4.0000000000000001E-3,{"$f":"H94*M94","v":8},{"$f":"N94*1.25","v":10},{"$f":"N94*1.4","v":11.2},{"$f":"O90","v":5},{"$f":"N94/M94","v":2000},{"$f":"O94/M94","v":2500},{"$f":"P94/M94","v":2799.9999999999995},{"$f":"IF(S90<J94,S90,J94)","v":1250},{"$f":"VLOOKUP(F94,AGE!F:J,4,FALSE)","v":2013},{"$f":"VLOOKUP(F94,AGE!F:J,5,FALSE)","v":2010},null,0,0]
[30,20,3,"30203","Duathlon","Jeune 8-11","Course à pied",500,550,450,5,"Min/km",5.0000000000000001E-3,2.5,3.125,3.5,1.5625,500,625,700,312.5,{"$f":"VLOOKUP(F95,AGE!F:J,4,FALSE)","v":2013},{"$f":"VLOOKUP(F95,AGE!F:J,5,FALSE)","v":2010},null,0,0]
[30,20,4,"30204","Duathlon","Jeune 8-11","Total",{"$f":"+SUM(H93:H95)","v":3000},{"$f":"SUM(I93:I95)","v":3300},{"$f":"SUM(J93:J95)","v":2700},null,null,"",{"$f":"SUM(N93:N95)","v":13},{"$f":"SUM(O93:O95)","v":16.25},null,{"$f":"SUM(Q93:Q95)","v":8.125},{"$f":"SUM(R93:R95)","v":3000},{"$f":"SUM(S93:S95)","v":3750},null,{"$f":"SUM(U93:U95)","v":1875},{"$f":"VLOOKUP(F96,AGE!F:J,4,FALSE)","v":2013},{"$f":"VLOOKUP(F96,AGE!F:J,5,FALSE)","v":2010},null,0,0]
[30,30,1,"30301","Duathlon","Jeune 10-13","Course à pied",750,{"$f":"H97*1.1","v":825.00000000000011},{"$f":"H97*0.9","v":675},5,"Min/km",5.0000000000000001E-3,{"$f":"H97*M97","v":3.75},{"$f":"N97*1.25","v":4.6875},{"$f":"N97*1.4","v":5.25},{"$f":"O93","v":3.125},{"$f":"N97/M97","v":750},{"$f":"O97/M97","v":937.5},{"$f":"P97/M97","v":1050},{"$f":"IF(S93<J97,S93,J97)","v":625},{"$f":"VLOOKUP(F97,AGE!F:J,4,FALSE)","v":2011},{"$f":"VLOOKUP(F97,AGE!F:J,5,FALSE)","v":2008},null,0,0]
[30,30,2,"30302","Duathlon","Jeune 10-13","Cyclisme",5000,{"$f":"H98*1.1","v":5500},{"$f":"H98*0.9","v":4500},15,"Km/h",4.0000000000000001E-3,{"$f":"H98*M98","v":20},{"$f":"N98*1.25","v":25},{"$f":"N98*1.4","v":28},{"$f":"O94","v":10},{"$f":"N98/M98","v":5000},{"$f":"O98/M98","v":6250},{"$f":"P98/M98","v":7000},{"$f":"IF(S94<J98,S94,J98)","v":2500},{"$f":"VLOOKUP(F98,AGE!F:J,4,FALSE)","v":2011},{"$f":"VLOOKUP(F98,AGE!F:J,5,FALSE)","v":2008},null,0,0]
[30,30,3,"30303","Duathlon","Jeune 10-13","Course à pied",750,825.00000000000011,675,5,"Min/km",5.0000000000000001E-3,3.75,4.6875,5.25,3.125,750,937.5,1050,625,{"$f":"VLOOKUP(F99,AGE!F:J,4,FALSE)","v":2011},{"$f":"VLOOKUP(F99,AGE!F:J,5,FALSE)","v":2008},null,0,0]
[30,30,4,"30304","Duathlon","Jeune 10-13","Total",{"$f":"+SUM(H97:H99)","v":6500},{"$f":"SUM(I97:I99)","v":7150},{"$f":"SUM(J97:J99)","v":5850},null,null,"",{"$f":"SUM(N97:N99)","v":27.5},{"$f":"SUM(O97:O99)","v":34.375},null,{"$f":"SUM(Q97:Q99)","v":16.25},{"$f":"SUM(R97:R99)","v":6500},{"$f":"SUM(S97:S99)","v":8125},null,{"$f":"SUM(U97:U99)","v":3750},{"$f":"VLOOKUP(F100,AGE!F:J,4,FALSE)","v":2011},{"$f":"VLOOKUP(F100,AGE!F:J,5,FALSE)","v":2008},null,0,0]
[30,40,1,"30401","Duathlon","Jeune 12-19","Course à pied",1000,{"$f":"H101*1.1","v":1100},{"$f":"H101*0.9","v":900},5,"Min/km",{"$f":"IF(L101=\"Sec/100m\",((K101)/60/100),(IF(L101=\"Km/h\",60/K101/1000,(IF(L101=\"Min/km\",K101/1000,\"\")))))","v":5.0000000000000001E-3},{"$f":"H101*M101","v":5},{"$f":"N101*1.25","v":6.25},{"$f":"N101*1.4","v":7},{"$f":"O97","v":4.6875},{"$f":"N101/M101","v":1000},{"$f":"O101/M101","v":1250},{"$f":"P101/M101","v":1400},{"$f":"IF(S97<J101,S97,J101)","v":900},{"$f":"VLOOKUP(F101,AGE!F:J,4,FALSE)","v":2009},{"$f":"VLOOKUP(F101,AGE!F:J,5,FALSE)","v":2002},null,0,0]
[30,40,2,"30402","Duathlon","Jeune 12-19","Cyclisme",6000,{"$f":"H102*1.1","v":6600.0000000000009},{"$f":"H102*0.9","v":5400},15,"Km/h",4.0000000000000001E-3,{"$f":"H102*M102","v":24},{"$f":"N102*1.25","v":30},{"$f":"N102*1.4","v":33.599999999999994},{"$f":"O98","v":25},{"$f":"N102/M102","v":6000},{"$f":"O102/M102","v":7500},{"$f":"P102/M102","v":8399.9999999999982},{"$f":"IF(S98<J102,S98,J102)","v":5400},{"$f":"VLOOKUP(F102,AGE!F:J,4,FALSE)","v":2009},{"$f":"VLOOKUP(F102,AGE!F:J,5,FALSE)","v":2002},null,{"$f":"IF(U102>R102,\"Attention dist basse assimilée > distance officielle\",)","v":0},0]
[30,40,3,"30403","Duathlon","Jeune 12-19","Course à pied",1000,1100,900,5,"Min/km",{"$f":"IF(L103=\"Sec/100m\",((K103)/60/100),(IF(L103=\"Km/h\",60/K103/1000,(IF(L103=\"Min/km\",K103/1000,\"\")))))","v":5.0000000000000001E-3},5,6.25,7,4.6875,1000,1250,1400,900,{"$f":"VLOOKUP(F103,AGE!F:J,4,FALSE)","v":2009},{"$f":"VLOOKUP(F103,AGE!F:J,5,FALSE)","v":2002},null,{"$f":"IF(U103>R103,\"Attention dist basse assimilée > distance officielle\",)","v":0},0]
[30,40,4,"30404","Duathlon","Jeune 12-19","Total",{"$f":"+SUM(H101:H103)","v":8000},{"$f":"SUM(I101:I103)","v":8800},{"$f":"SUM(J101:J103)","v":7200},null,null,"",{"$f":"SUM(N101:N103)","v":34},{"$f":"SUM(O101:O103)","v":42.5},null,{"$f":"SUM(Q101:Q103)","v":34.375},{"$f":"SUM(R101:R103)","v":8000},{"$f":"SUM(S101:S103)","v":10000},null,{"$f":"SUM(U101:U103)","v":7200},{"$f":"VLOOKUP(F104,AGE!F:J,4,FALSE)","v":2009},{"$f":"VLOOKUP(F104,AGE!F:J,5,FALSE)","v":2002},null,0,0]
[30,41,1,"30411","Duathlon","Distance XXS","Course à pied",1500,{"$f":"H105*1.1","v":1650.0000000000002},{"$f":"H105*0.9","v":1350},4.5,"Min/km",4.4999999999999997E-3,{"$f":"H105*M105","v":6.7499999999999991},{"$f":"N105*1.25","v":8.4374999999999982},{"$f":"N105*1.4","v":9.4499999999999975},{"$f":"O97","v":4.6875},{"$f":"N105/M105","v":1500},{"$f":"O105/M105","v":1874.9999999999998},{"$f":"P105/M105","v":2099.9999999999995},{"$f":"(N105*0.5)/M105","v":750},{"$f":"VLOOKUP(F105,AGE!F:J,4,FALSE)","v":2009},{"$f":"VLOOKUP(F105,AGE!F:J,5,FALSE)","v":1922},null,{"$f":"IF(U105>R105,\"Attention dist basse assimilée > distance officielle\",)","v":0},{"$f":"IF(U105>J105,\"Attention dist basse assimilée > distance officielle tolérance 10%\",)","v":0}]
[30,41,2,"30412","Duathlon","Distance XXS","Cyclisme",6000,{"$f":"H106*1.1","v":6600.0000000000009},{"$f":"H106*0.9","v":5400},15,"Km/h",4.0000000000000001E-3,{"$f":"H106*M106","v":24},{"$f":"N106*1.25","v":30},33.599999999999994,{"$f":"O98","v":25},{"$f":"N106/M106","v":6000},{"$f":"O106/M106","v":7500},{"$f":"P106/M106","v":8399.9999999999982},{"$f":"(N106*0.5)/M106","v":3000},{"$f":"VLOOKUP(F106,AGE!F:J,4,FALSE)","v":2009},{"$f":"VLOOKUP(F106,AGE!F:J,5,FALSE)","v":1922},null,0,0]
[30,41,3,"30413","Duathlon","Distance XXS","Course à pied",1000,1100,900,4.5,"Min/km",4.4999999999999997E-3,4.5,5.625,6.3,{"$f":"O99","v":4.6875},1000.0000000000001,1250,1400,500.00000000000006,{"$f":"VLOOKUP(F107,AGE!F:J,4,FALSE)","v":2009},{"$f":"VLOOKUP(F107,AGE!F:J,5,FALSE)","v":1922},null,0,0]
[30,41,4,"30414","Duathlon","Distance XXS","Total",{"$f":"+SUM(H105:H107)","v":8500},{"$f":"SUM(I105:I107)","v":9350.0000000000018},{"$f":"SUM(J105:J107)","v":7650},null,null,"",{"$f":"SUM(N105:N107)","v":35.25},{"$f":"SUM(O105:O107)","v":44.0625},null,{"$f":"SUM(Q105:Q107)","v":34.375},{"$f":"SUM(R105:R107)","v":8500},{"$f":"SUM(S105:S107)","v":10625},null,{"$f":"SUM(U105:U107)","v":4250},{"$f":"VLOOKUP(F108,AGE!F:J,4,FALSE)","v":2009},{"$f":"VLOOKUP(F108,AGE!F:J,5,FALSE)","v":1922},null,0,0]
[30,50,1,"30501","Duathlon","Distance XS","Course à pied",2500,{"$f":"H109*1.1","v":2750},{"$f":"H109*0.9","v":2250},4.5,"Min/km",{"$f":"IF(L109=\"Sec/100m\",((K109)/60/100),(IF(L109=\"Km/h\",60/K109/1000,(IF(L109=\"Min/km\",K109/1000,\"\")))))","v":4.4999999999999997E-3},{"$f":"H109*M109","v":11.25},{"$f":"N109*1.25","v":14.0625},{"$f":"N109*1.4","v":15.749999999999998},{"$f":"O101","v":6.25},{"$f":"N109/M109","v":2500},{"$f":"O109/M109","v":3125.0000000000005},{"$f":"P109/M109","v":3500},{"$f":"IF(S105<J109,S105,J109)","v":1874.9999999999998},{"$f":"VLOOKUP(F109,AGE!F:J,4,FALSE)","v":2009},{"$f":"VLOOKUP(F109,AGE!F:J,5,FALSE)","v":1922},null,0,0]
[30,50,2,"30502","Duathlon","Distance XS","Cyclisme",10000,{"$f":"H110*1.1","v":11000},{"$f":"H110*0.9","v":9000},15,"Km/h",4.0000000000000001E-3,{"$f":"H110*M110","v":40},{"$f":"N110*1.25","v":50},56,{"$f":"O102","v":30},{"$f":"N110/M110","v":10000},{"$f":"O110/M110","v":12500},{"$f":"P110/M110","v":14000},{"$f":"IF(S106<J110,S106,J110)","v":7500},{"$f":"VLOOKUP(F110,AGE!F:J,4,FALSE)","v":2009},{"$f":"VLOOKUP(F110,AGE!F:J,5,FALSE)","v":1922},null,0,0]
[30,50,3,"30503","Duathlon","Distance XS","Course à pied",1250,1375,1125,4.5,"Min/km",4.4999999999999997E-3,5.625,7.03125,7.8749999999999991,{"$f":"O103","v":6.25},1250,1562.5000000000002,1750,1125,{"$f":"VLOOKUP(F111,AGE!F:J,4,FALSE)","v":2009},{"$f":"VLOOKUP(F111,AGE!F:J,5,FALSE)","v":1922},null,0,0]
[30,50,4,"30504","Duathlon","Distance XS","Total",{"$f":"+SUM(H109:H111)","v":13750},{"$f":"SUM(I109:I111)","v":15125},{"$f":"SUM(J109:J111)","v":12375},null,null,"",{"$f":"SUM(N109:N111)","v":56.875},{"$f":"SUM(O109:O111)","v":71.09375},null,{"$f":"SUM(Q109:Q111)","v":42.5},{"$f":"SUM(R109:R111)","v":13750},{"$f":"SUM(S109:S111)","v":17187.5},null,{"$f":"SUM(U109:U111)","v":10500},{"$f":"VLOOKUP(F112,AGE!F:J,4,FALSE)","v":2009},{"$f":"VLOOKUP(F112,AGE!F:J,5,FALSE)","v":1922},null,0,0]
[30,60,1,"30601","Duathlon","Distance S","Course à pied",5000,{"$f":"H113*1.1","v":5500},{"$f":"H113*0.9","v":4500},4.5,"Min/km",4.4999999999999997E-3,{"$f":"H113*M113","v":22.5},{"$f":"N113*1.25","v":28.125},{"$f":"N113*1.4","v":31.499999999999996},{"$f":"O109","v":14.0625},{"$f":"N113/M113","v":5000},{"$f":"O113/M113","v":6250.0000000000009},{"$f":"P113/M113","v":7000},{"$f":"IF(S109<J113,S109,J113)","v":3125.0000000000005},{"$f":"VLOOKUP(F113,AGE!F:J,4,FALSE)","v":2005},{"$f":"VLOOKUP(F113,AGE!F:J,5,FALSE)","v":1922},null,0,0]
[30,60,2,"30602","Duathlon","Distance S","Cyclisme",20000,{"$f":"H114*1.1","v":22000},{"$f":"H114*0.9","v":18000},32,"Km/h",1.8749999999999999E-3,{"$f":"H114*M114","v":37.5},{"$f":"N114*1.25","v":46.875},52.5,{"$f":"O110","v":50},{"$f":"N114/M114","v":20000},{"$f":"O114/M114","v":25000},{"$f":"P114/M114","v":28000},{"$f":"IF(S110<J114,S110,J114)","v":12500},{"$f":"VLOOKUP(F114,AGE!F:J,4,FALSE)","v":2005},{"$f":"VLOOKUP(F114,AGE!F:J,5,FALSE)","v":1922},null,0,0]
[30,60,3,"30603","Duathlon","Distance S","Course à pied",2500,2750,2250,4.5,"Min/km",4.4999999999999997E-3,11.25,14.0625,15.749999999999998,7.03125,2500,3125.0000000000005,3500,1562.5000000000002,{"$f":"VLOOKUP(F115,AGE!F:J,4,FALSE)","v":2005},{"$f":"VLOOKUP(F115,AGE!F:J,5,FALSE)","v":1922},null,0,0]
[30,60,4,"30604","Duathlon","Distance S","Total",{"$f":"+SUM(H113:H115)","v":27500},{"$f":"SUM(I113:I115)","v":30250},{"$f":"SUM(J113:J115)","v":24750},null,null,"",{"$f":"SUM(N113:N115)","v":71.25},{"$f":"SUM(O113:O115)","v":89.0625},null,{"$f":"SUM(Q113:Q115)","v":71.09375},{"$f":"SUM(R113:R115)","v":27500},{"$f":"SUM(S113:S115)","v":34375},null,{"$f":"SUM(U113:U115)","v":17187.5},{"$f":"VLOOKUP(F116,AGE!F:J,4,FALSE)","v":2005},{"$f":"VLOOKUP(F116,AGE!F:J,5,FALSE)","v":1922},null,0,0]
[30,70,1,"30701","Duathlon","Distance M","Course à pied",10000,{"$f":"H117*1.1","v":11000},{"$f":"H117*0.9","v":9000},4.5,"Min/km",4.4999999999999997E-3,{"$f":"H117*M117","v":45},{"$f":"N117*1.25","v":56.25},{"$f":"N117*1.4","v":62.999999999999993},{"$f":"O113","v":28.125},{"$f":"N117/M117","v":10000},{"$f":"O117/M117","v":12500.000000000002},{"$f":"P117/M117","v":14000},{"$f":"IF(S113<J117,S113,J117)","v":6250.0000000000009},{"$f":"VLOOKUP(F117,AGE!F:J,4,FALSE)","v":2003},{"$f":"VLOOKUP(F117,AGE!F:J,5,FALSE)","v":1922},null,0,0]
[30,70,2,"30702","Duathlon","Distance M","Cyclisme",40000,{"$f":"H118*1.1","v":44000},{"$f":"H118*0.9","v":36000},32,"Km/h",1.8749999999999999E-3,{"$f":"H118*M118","v":75},{"$f":"N118*1.25","v":93.75},105,{"$f":"O114","v":46.875},{"$f":"N118/M118","v":40000},{"$f":"O118/M118","v":50000},{"$f":"P118/M118","v":56000},{"$f":"IF(S114<J118,S114,J118)","v":25000},{"$f":"VLOOKUP(F118,AGE!F:J,4,FALSE)","v":2003},{"$f":"VLOOKUP(F118,AGE!F:J,5,FALSE)","v":1922},null,0,0]
[30,70,3,"30703","Duathlon","Distance M","Course à pied",5000,5500,4500,4.5,"Min/km",4.4999999999999997E-3,22.5,28.125,31.499999999999996,14.0625,5000,6250.0000000000009,7000,3125.0000000000005,{"$f":"VLOOKUP(F119,AGE!F:J,4,FALSE)","v":2003},{"$f":"VLOOKUP(F119,AGE!F:J,5,FALSE)","v":1922},null,0,0]
[30,70,4,"30704","Duathlon","Distance M","Total",{"$f":"+SUM(H117:H119)","v":55000},{"$f":"SUM(I117:I119)","v":60500},{"$f":"SUM(J117:J119)","v":49500},null,null,"",{"$f":"SUM(N117:N119)","v":142.5},{"$f":"SUM(O117:O119)","v":178.125},null,{"$f":"SUM(Q117:Q119)","v":89.0625},{"$f":"SUM(R117:R119)","v":55000},{"$f":"SUM(S117:S119)","v":68750},null,{"$f":"SUM(U117:U119)","v":34375},{"$f":"VLOOKUP(F120,AGE!F:J,4,FALSE)","v":2003},{"$f":"VLOOKUP(F120,AGE!F:J,5,FALSE)","v":1922},null,0,0]
[30,80,1,"30801","Duathlon","Distance L","Course à pied",20000,{"$f":"H121*1.1","v":22000},{"$f":"H121*0.9","v":18000},4.5,"Min/km",4.4999999999999997E-3,{"$f":"H121*M121","v":90},{"$f":"N121*1.25","v":112.5},null,{"$f":"O117","v":56.25},{"$f":"N121/M121","v":20000},{"$f":"O121/M121","v":25000.000000000004},{"$f":"P121/M121","v":0},{"$f":"IF(S117<J121,S117,J121)","v":12500.000000000002},{"$f":"VLOOKUP(F121,AGE!F:J,4,FALSE)","v":2003},{"$f":"VLOOKUP(F121,AGE!F:J,5,FALSE)","v":1922},null,0,0]
[30,80,2,"30802","Duathlon","Distance L","Cyclisme",80000,{"$f":"H122*1.1","v":88000},{"$f":"H122*0.9","v":72000},32,"Km/h",1.8749999999999999E-3,{"$f":"H122*M122","v":150},{"$f":"N122*1.25","v":187.5},null,{"$f":"O118","v":93.75},{"$f":"N122/M122","v":80000},{"$f":"O122/M122","v":100000},{"$f":"P122/M122","v":0},{"$f":"IF(S118<J122,S118,J122)","v":50000},{"$f":"VLOOKUP(F122,AGE!F:J,4,FALSE)","v":2003},{"$f":"VLOOKUP(F122,AGE!F:J,5,FALSE)","v":1922},null,0,0]
[30,80,3,"30803","Duathlon","Distance L","Course à pied",10000,11000,9000,4.5,"Min/km",4.4999999999999997E-3,{"$f":"H123*M123","v":45},56.25,null,28.125,10000,12500.000000000002,0,6250.0000000000009,{"$f":"VLOOKUP(F123,AGE!F:J,4,FALSE)","v":2003},{"$f":"VLOOKUP(F123,AGE!F:J,5,FALSE)","v":1922},null,0,0]
[30,80,4,"30804","Duathlon","Distance L","Total",{"$f":"+SUM(H121:H123)","v":110000},{"$f":"SUM(I121:I123)","v":121000},{"$f":"SUM(J121:J123)","v":99000},null,null,"",{"$f":"SUM(N121:N123)","v":285},{"$f":"SUM(O121:O123)","v":356.25},null,{"$f":"SUM(Q121:Q123)","v":178.125},{"$f":"SUM(R121:R123)","v":110000},{"$f":"SUM(S121:S123)","v":137500},null,{"$f":"SUM(U121:U123)","v":68750},{"$f":"VLOOKUP(F124,AGE!F:J,4,FALSE)","v":2003},{"$f":"VLOOKUP(F124,AGE!F:J,5,FALSE)","v":1922},null,0,0]
[30,90,1,"30901","Duathlon","Distance XL","Course à pied",20000,{"$f":"H125*1.1","v":22000},{"$f":"H125*0.9","v":18000},4.5,"Min/km",4.4999999999999997E-3,{"$f":"H125*M125","v":90},{"$f":"N125*1.25","v":112.5},null,{"$f":"O121","v":112.5},{"$f":"N125/M125","v":20000},{"$f":"O125/M125","v":25000.000000000004},{"$f":"P125/M125","v":0},{"$f":"(N125*0.75)/M125","v":15000.000000000002},{"$f":"VLOOKUP(F125,AGE!F:J,4,FALSE)","v":2003},{"$f":"VLOOKUP(F125,AGE!F:J,5,FALSE)","v":1922},null,0,0]
[30,90,2,"30902","Duathlon","Distance XL","Cyclisme",120000,{"$f":"H126*1.1","v":132000},{"$f":"H126*0.9","v":108000},32,"Km/h",1.8749999999999999E-3,{"$f":"H126*M126","v":225},{"$f":"N126*1.25","v":281.25},null,{"$f":"O122","v":187.5},{"$f":"N126/M126","v":120000},{"$f":"O126/M126","v":150000},{"$f":"P126/M126","v":0},{"$f":"(N126*0.75)/M126","v":90000},{"$f":"VLOOKUP(F126,AGE!F:J,4,FALSE)","v":2003},{"$f":"VLOOKUP(F126,AGE!F:J,5,FALSE)","v":1922},null,0,0]
[30,90,3,"30903","Duathlon","Distance XL","Course à pied",20000,22000,18000,4.5,"Min/km",4.4999999999999997E-3,90,112.5,null,56.25,20000,25000.000000000004,0,15000.000000000002,{"$f":"VLOOKUP(F127,AGE!F:J,4,FALSE)","v":2003},{"$f":"VLOOKUP(F127,AGE!F:J,5,FALSE)","v":1922},null,0,0]
[30,90,4,"30904","Duathlon","Distance XL","Total",{"$f":"+SUM(H125:H127)","v":160000},{"$f":"SUM(I125:I127)","v":176000},{"$f":"SUM(J125:J127)","v":144000},null,null,"",{"$f":"SUM(N125:N127)","v":405},{"$f":"SUM(O125:O127)","v":506.25},null,{"$f":"SUM(Q125:Q127)","v":356.25},{"$f":"SUM(R125:R127)","v":160000},{"$f":"SUM(S125:S127)","v":200000},null,{"$f":"SUM(U125:U127)","v":120000},{"$f":"VLOOKUP(F128,AGE!F:J,4,FALSE)","v":2003},{"$f":"VLOOKUP(F128,AGE!F:J,5,FALSE)","v":1922},null,0,0]
[40,10,1,"40101","Cross Duathlon","Jeune 6-9","Course à pied",250,{"$f":"H129*1.1","v":275},{"$f":"H129*0.9","v":225},5,"Min/km",5.0000000000000001E-3,{"$f":"H129*M129","v":1.25},{"$f":"N129*1.25","v":1.5625},{"$f":"N129*1.4","v":1.75},null,{"$f":"N129/M129","v":250},{"$f":"O129/M129","v":312.5},{"$f":"P129/M129","v":350},{"$f":"+R129/2","v":125},{"$f":"VLOOKUP(F129,AGE!F:J,4,FALSE)","v":2015},{"$f":"VLOOKUP(F129,AGE!F:J,5,FALSE)","v":2012},null,0,0]
[40,10,2,"40102","Cross Duathlon","Jeune 6-9","Vélo",1000,{"$f":"H130*1.1","v":1100},{"$f":"H130*0.9","v":900},15,"Km/h",4.0000000000000001E-3,{"$f":"H130*M130","v":4},{"$f":"N130*1.25","v":5},{"$f":"N130*1.4","v":5.6},null,{"$f":"N130/M130","v":1000},{"$f":"O130/M130","v":1250},{"$f":"P130/M130","v":1399.9999999999998},{"$f":"+R130/2","v":500},{"$f":"VLOOKUP(F130,AGE!F:J,4,FALSE)","v":2015},{"$f":"VLOOKUP(F130,AGE!F:J,5,FALSE)","v":2012},null,0,0]
[40,10,3,"40103","Cross Duathlon","Jeune 6-9","Course à pied",250,275,225,5,"Min/km",5.0000000000000001E-3,1.25,1.5625,1.75,null,250,312.5,350,{"$f":"+R131/2","v":125},{"$f":"VLOOKUP(F131,AGE!F:J,4,FALSE)","v":2015},{"$f":"VLOOKUP(F131,AGE!F:J,5,FALSE)","v":2012},null,0,0]
[40,10,4,"40104","Cross Duathlon","Jeune 6-9","Total",{"$f":"+SUM(H129:H131)","v":1500},{"$f":"SUM(I129:I131)","v":1650},{"$f":"SUM(J129:J131)","v":1350},null,null,"",{"$f":"SUM(N129:N131)","v":6.5},{"$f":"SUM(O129:O131)","v":8.125},null,{"$f":"SUM(Q129:Q131)","v":0},{"$f":"SUM(R129:R131)","v":1500},{"$f":"SUM(S129:S131)","v":1875},null,{"$f":"SUM(U129:U131)","v":750},{"$f":"VLOOKUP(F132,AGE!F:J,4,FALSE)","v":2015},{"$f":"VLOOKUP(F132,AGE!F:J,5,FALSE)","v":2012},null,0,0]
[40,20,1,"40201","Cross Duathlon","Jeune 8-11","Course à pied",500,{"$f":"H133*1.1","v":550},{"$f":"H133*0.9","v":450},5,"Min/km",5.0000000000000001E-3,{"$f":"H133*M133","v":2.5},{"$f":"N133*1.25","v":3.125},{"$f":"N133*1.4","v":3.5},{"$f":"O129","v":1.5625},{"$f":"N133/M133","v":500},{"$f":"O133/M133","v":625},{"$f":"P133/M133","v":700},{"$f":"IF(S129<J133,S129,J133)","v":312.5},{"$f":"VLOOKUP(F133,AGE!F:J,4,FALSE)","v":2013},{"$f":"VLOOKUP(F133,AGE!F:J,5,FALSE)","v":2010},null,0,0]
[40,20,2,"40202","Cross Duathlon","Jeune 8-11","Vélo",2000,{"$f":"H134*1.1","v":2200},{"$f":"H134*0.9","v":1800},15,"Km/h",4.0000000000000001E-3,{"$f":"H134*M134","v":8},{"$f":"N134*1.25","v":10},{"$f":"N134*1.4","v":11.2},{"$f":"O130","v":5},{"$f":"N134/M134","v":2000},{"$f":"O134/M134","v":2500},{"$f":"P134/M134","v":2799.9999999999995},{"$f":"IF(S130<J134,S130,J134)","v":1250},{"$f":"VLOOKUP(F134,AGE!F:J,4,FALSE)","v":2013},{"$f":"VLOOKUP(F134,AGE!F:J,5,FALSE)","v":2010},null,0,0]
[40,20,3,"40203","Cross Duathlon","Jeune 8-11","Course à pied",500,550,450,5,"Min/km",5.0000000000000001E-3,2.5,3.125,3.5,1.5625,500,625,700,312.5,{"$f":"VLOOKUP(F135,AGE!F:J,4,FALSE)","v":2013},{"$f":"VLOOKUP(F135,AGE!F:J,5,FALSE)","v":2010},null,0,0]
[40,20,4,"40204","Cross Duathlon","Jeune 8-11","Total",{"$f":"+SUM(H133:H135)","v":3000},{"$f":"SUM(I133:I135)","v":3300},{"$f":"SUM(J133:J135)","v":2700},null,null,"",{"$f":"SUM(N133:N135)","v":13},{"$f":"SUM(O133:O135)","v":16.25},null,{"$f":"SUM(Q133:Q135)","v":8.125},{"$f":"SUM(R133:R135)","v":3000},{"$f":"SUM(S133:S135)","v":3750},null,{"$f":"SUM(U133:U135)","v":1875},{"$f":"VLOOKUP(F136,AGE!F:J,4,FALSE)","v":2013},{"$f":"VLOOKUP(F136,AGE!F:J,5,FALSE)","v":2010},null,0,0]
[40,30,1,"40301","Cross Duathlon","Jeune 10-13","Course à pied",750,{"$f":"H137*1.1","v":825.00000000000011},{"$f":"H137*0.9","v":675},5,"Min/km",5.0000000000000001E-3,{"$f":"H137*M137","v":3.75},{"$f":"N137*1.25","v":4.6875},{"$f":"N137*1.4","v":5.25},{"$f":"O133","v":3.125},{"$f":"N137/M137","v":750},{"$f":"O137/M137","v":937.5},{"$f":"P137/M137","v":1050},{"$f":"IF(S133<J137,S133,J137)","v":625},{"$f":"VLOOKUP(F137,AGE!F:J,4,FALSE)","v":2011},{"$f":"VLOOKUP(F137,AGE!F:J,5,FALSE)","v":2008},null,0,0]
[40,30,2,"40302","Cross Duathlon","Jeune 10-13","Cyclisme",5000,{"$f":"H138*1.1","v":5500},{"$f":"H138*0.9","v":4500},15,"Km/h",4.0000000000000001E-3,{"$f":"H138*M138","v":20},{"$f":"N138*1.25","v":25},{"$f":"N138*1.4","v":28},{"$f":"O134","v":10},{"$f":"N138/M138","v":5000},{"$f":"O138/M138","v":6250},{"$f":"P138/M138","v":7000},{"$f":"IF(S134<J138,S134,J138)","v":2500},{"$f":"VLOOKUP(F138,AGE!F:J,4,FALSE)","v":2011},{"$f":"VLOOKUP(F138,AGE!F:J,5,FALSE)","v":2008},null,0,0]
[40,30,3,"40303","Cross Duathlon","Jeune 10-13","Course à pied",750,825.00000000000011,675,5,"Min/km",5.0000000000000001E-3,3.75,4.6875,5.25,3.125,750,937.5,1050,625,{"$f":"VLOOKUP(F139,AGE!F:J,4,FALSE)","v":2011},{"$f":"VLOOKUP(F139,AGE!F:J,5,FALSE)","v":2008},null,0,0]
[40,30,4,"40304","Cross Duathlon","Jeune 10-13","Total",{"$f":"+SUM(H137:H139)","v":6500},{"$f":"SUM(I137:I139)","v":7150},{"$f":"SUM(J137:J139)","v":5850},null,null,"",{"$f":"SUM(N137:N139)","v":27.5},{"$f":"SUM(O137:O139)","v":34.375},null,{"$f":"SUM(Q137:Q139)","v":16.25},{"$f":"SUM(R137:R139)","v":6500},{"$f":"SUM(S137:S139)","v":8125},null,{"$f":"SUM(U137:U139)","v":3750},{"$f":"VLOOKUP(F140,AGE!F:J,4,FALSE)","v":2011},{"$f":"VLOOKUP(F140,AGE!F:J,5,FALSE)","v":2008},null,0,0]
[40,40,1,"40401","Cross Duathlon","Jeune 12-19","Course à pied",1000,{"$f":"H141*1.1","v":1100},{"$f":"H141*0.9","v":900},5,"Min/km",5.0000000000000001E-3,{"$f":"H141*M141","v":5},{"$f":"N141*1.25","v":6.25},{"$f":"N141*1.4","v":7},{"$f":"O137","v":4.6875},{"$f":"N141/M141","v":1000},{"$f":"O141/M141","v":1250},{"$f":"P141/M141","v":1400},{"$f":"IF(S137<J141,S137,J141)","v":900},{"$f":"VLOOKUP(F141,AGE!F:J,4,FALSE)","v":2009},{"$f":"VLOOKUP(F141,AGE!F:J,5,FALSE)","v":2002},null,0,0]
[40,40,2,"40402","Cross Duathlon","Jeune 12-19","Cyclisme",6000,{"$f":"H142*1.1","v":6600.0000000000009},{"$f":"H142*0.9","v":5400},15,"Km/h",4.0000000000000001E-3,{"$f":"H142*M142","v":24},{"$f":"N142*1.25","v":30},{"$f":"N142*1.4","v":33.599999999999994},{"$f":"O138","v":25},{"$f":"N142/M142","v":6000},{"$f":"O142/M142","v":7500},{"$f":"P142/M142","v":8399.9999999999982},{"$f":"IF(S138<J142,S138,J142)","v":5400},{"$f":"VLOOKUP(F142,AGE!F:J,4,FALSE)","v":2009},{"$f":"VLOOKUP(F142,AGE!F:J,5,FALSE)","v":2002},null,0,0]
[40,40,3,"40403","Cross Duathlon","Jeune 12-19","Course à pied",1000,1100,900,5,"Min/km",5.0000000000000001E-3,5,6.25,7,4.6875,1000,1250,1400,900,{"$f":"VLOOKUP(F143,AGE!F:J,4,FALSE)","v":2009},{"$f":"VLOOKUP(F143,AGE!F:J,5,FALSE)","v":2002},null,0,0]
[40,40,4,"40404","Cross Duathlon","Jeune 12-19","Total",{"$f":"+SUM(H141:H143)","v":8000},{"$f":"SUM(I141:I143)","v":8800},{"$f":"SUM(J141:J143)","v":7200},null,null,"",{"$f":"SUM(N141:N143)","v":34},{"$f":"SUM(O141:O143)","v":42.5},null,{"$f":"SUM(Q141:Q143)","v":34.375},{"$f":"SUM(R141:R143)","v":8000},{"$f":"SUM(S141:S143)","v":10000},null,{"$f":"SUM(U141:U143)","v":7200},{"$f":"VLOOKUP(F144,AGE!F:J,4,FALSE)","v":2009},{"$f":"VLOOKUP(F144,AGE!F:J,5,FALSE)","v":2002},null,0,0]
[40,41,1,"40411","Cross Duathlon","Distance XXS","Course à pied",1500,{"$f":"H145*1.1","v":1650.0000000000002},{"$f":"H145*0.9","v":1350},4.5,"Min/km",{"$f":"IF(L145=\"Sec/100m\",((K145)/60/100),(IF(L145=\"Km/h\",60/K145/1000,(IF(L145=\"Min/km\",K145/1000,\"\")))))","v":4.4999999999999997E-3},{"$f":"H145*M145","v":6.7499999999999991},{"$f":"N145*1.25","v":8.4374999999999982},{"$f":"N145*1.4","v":9.4499999999999975},{"$f":"O137","v":4.6875},{"$f":"N145/M145","v":1500},{"$f":"O145/M145","v":1874.9999999999998},{"$f":"P145/M145","v":2099.9999999999995},{"$f":"(N145*0.5)/M145","v":750},{"$f":"VLOOKUP(F145,AGE!F:J,4,FALSE)","v":2009},{"$f":"VLOOKUP(F145,AGE!F:J,5,FALSE)","v":1922},null,{"$f":"IF(U145>R145,\"Attention dist basse assimilée > distance officielle\",)","v":0},{"$f":"IF(U145>J145,\"Attention dist basse assimilée > distance officielle tolérance 10%\",)","v":0}]
[40,41,2,"40412","Cross Duathlon","Distance XXS","Cyclisme",4000,{"$f":"H146*1.1","v":4400},{"$f":"H146*0.9","v":3600},15,"Km/h",4.0000000000000001E-3,{"$f":"H146*M146","v":16},{"$f":"N146*1.25","v":20},22.4,{"$f":"O138","v":25},{"$f":"N146/M146","v":4000},{"$f":"O146/M146","v":5000},{"$f":"P146/M146","v":5599.9999999999991},{"$f":"(N146*0.5)/M146","v":2000},{"$f":"VLOOKUP(F146,AGE!F:J,4,FALSE)","v":2009},{"$f":"VLOOKUP(F146,AGE!F:J,5,FALSE)","v":1922},null,0,0]
[40,41,3,"40413","Cross Duathlon","Distance XXS","Course à pied",800,880.00000000000011,720,4.5,"Min/km",4.4999999999999997E-3,3.5999999999999996,4.5,5.0399999999999991,{"$f":"O139","v":4.6875},800,1000.0000000000001,1120,400,{"$f":"VLOOKUP(F147,AGE!F:J,4,FALSE)","v":2009},{"$f":"VLOOKUP(F147,AGE!F:J,5,FALSE)","v":1922},null,0,0]
[40,41,4,"40414","Cross Duathlon","Distance XXS","Total",{"$f":"+SUM(H145:H147)","v":6300},{"$f":"SUM(I145:I147)","v":6930},{"$f":"SUM(J145:J147)","v":5670},null,null,"",{"$f":"SUM(N145:N147)","v":26.35},{"$f":"SUM(O145:O147)","v":32.9375},null,{"$f":"SUM(Q145:Q147)","v":34.375},{"$f":"SUM(R145:R147)","v":6300},{"$f":"SUM(S145:S147)","v":7875},null,{"$f":"SUM(U145:U147)","v":3150},{"$f":"VLOOKUP(F148,AGE!F:J,4,FALSE)","v":2009},{"$f":"VLOOKUP(F148,AGE!F:J,5,FALSE)","v":1922},null,0,0]
[40,50,1,"40501","Cross Duathlon","Distance XS","Course à pied",2000,{"$f":"H149*1.1","v":2200},{"$f":"H149*0.9","v":1800},4.5,"Min/km",4.4999999999999997E-3,{"$f":"H149*M149","v":9},{"$f":"N149*1.25","v":11.25},{"$f":"N149*1.4","v":12.6},{"$f":"O141","v":6.25},{"$f":"N149/M149","v":2000.0000000000002},{"$f":"O149/M149","v":2500},{"$f":"P149/M149","v":2800},{"$f":"IF(S145<J149,S145,J149)","v":1800},{"$f":"VLOOKUP(F149,AGE!F:J,4,FALSE)","v":2009},{"$f":"VLOOKUP(F149,AGE!F:J,5,FALSE)","v":1922},null,0,{"$f":"IF(U149>J149,\"Attention dist basse assimilée > distance officielle tolérance 10%\",)","v":0}]
[40,50,2,{"$f":"CONCATENATE(A150,B150,C150)","v":"40502"},"Cross Duathlon","Distance XS","Cyclisme",5500,{"$f":"H150*1.1","v":6050.0000000000009},{"$f":"H150*0.9","v":4950},15,"Km/h",4.0000000000000001E-3,{"$f":"H150*M150","v":22},{"$f":"N150*1.25","v":27.5},30.799999999999997,{"$f":"O142","v":30},{"$f":"N150/M150","v":5500},{"$f":"O150/M150","v":6875},{"$f":"P150/M150","v":7699.9999999999991},{"$f":"IF(S146<J150,S146,J150)","v":4950},{"$f":"VLOOKUP(F150,AGE!F:J,4,FALSE)","v":2009},{"$f":"VLOOKUP(F150,AGE!F:J,5,FALSE)","v":1922},null,0,0]
[40,50,3,"40503","Cross Duathlon","Distance XS","Course à pied",1000,1100,900,4.5,"Min/km",4.4999999999999997E-3,4.5,5.625,6.3,{"$f":"O143","v":6.25},1000.0000000000001,1250,1400,900,{"$f":"VLOOKUP(F151,AGE!F:J,4,FALSE)","v":2009},{"$f":"VLOOKUP(F151,AGE!F:J,5,FALSE)","v":1922},null,0,0]
[40,50,4,"40504","Cross Duathlon","Distance XS","Total",{"$f":"+SUM(H149:H151)","v":8500},{"$f":"SUM(I149:I151)","v":9350},{"$f":"SUM(J149:J151)","v":7650},null,null,"",{"$f":"SUM(N149:N151)","v":35.5},{"$f":"SUM(O149:O151)","v":44.375},null,{"$f":"SUM(Q149:Q151)","v":42.5},{"$f":"SUM(R149:R151)","v":8500},{"$f":"SUM(S149:S151)","v":10625},null,{"$f":"SUM(U149:U151)","v":7650},{"$f":"VLOOKUP(F152,AGE!F:J,4,FALSE)","v":2009},{"$f":"VLOOKUP(F152,AGE!F:J,5,FALSE)","v":1922},null,0,0]
[40,60,1,"40601","Cross Duathlon","Distance S","Course à pied",4000,{"$f":"H153*1.1","v":4400},{"$f":"H153*0.9","v":3600},4.5,"Min/km",4.4999999999999997E-3,{"$f":"H153*M153","v":18},{"$f":"N153*1.25","v":22.5},{"$f":"N153*1.4","v":25.2},{"$f":"O149","v":11.25},{"$f":"N153/M153","v":4000.0000000000005},{"$f":"O153/M153","v":5000},{"$f":"P153/M153","v":5600},{"$f":"IF(S149<J153,S149,J153)","v":2500},{"$f":"VLOOKUP(F153,AGE!F:J,4,FALSE)","v":2005},{"$f":"VLOOKUP(F153,AGE!F:J,5,FALSE)","v":1922},null,0,0]
[40,60,2,"40602","Cross Duathlon","Distance S","Cyclisme",11000,{"$f":"H154*1.1","v":12100.000000000002},{"$f":"H154*0.9","v":9900},15,"Km/h",4.0000000000000001E-3,{"$f":"H154*M154","v":44},{"$f":"N154*1.25","v":55},61.599999999999994,{"$f":"O150","v":27.5},{"$f":"N154/M154","v":11000},{"$f":"O154/M154","v":13750},{"$f":"P154/M154","v":15399.999999999998},{"$f":"IF(S150<J154,S150,J154)","v":6875},{"$f":"VLOOKUP(F154,AGE!F:J,4,FALSE)","v":2005},{"$f":"VLOOKUP(F154,AGE!F:J,5,FALSE)","v":1922},null,0,0]
[40,60,3,"40603","Cross Duathlon","Distance S","Course à pied",2000,2200,1800,4.5,"Min/km",4.4999999999999997E-3,9,11.25,12.6,5.625,2000.0000000000002,2500,2800,1250,{"$f":"VLOOKUP(F155,AGE!F:J,4,FALSE)","v":2005},{"$f":"VLOOKUP(F155,AGE!F:J,5,FALSE)","v":1922},null,0,0]
[40,60,4,"40604","Cross Duathlon","Distance S","Total",{"$f":"+SUM(H153:H155)","v":17000},{"$f":"SUM(I153:I155)","v":18700},{"$f":"SUM(J153:J155)","v":15300},null,null,"",{"$f":"SUM(N153:N155)","v":71},{"$f":"SUM(O153:O155)","v":88.75},null,{"$f":"SUM(Q153:Q155)","v":44.375},{"$f":"SUM(R153:R155)","v":17000},{"$f":"SUM(S153:S155)","v":21250},null,{"$f":"SUM(U153:U155)","v":10625},{"$f":"VLOOKUP(F156,AGE!F:J,4,FALSE)","v":2005},{"$f":"VLOOKUP(F156,AGE!F:J,5,FALSE)","v":1922},null,0,0]
[40,70,1,"40701","Cross Duathlon","Distance M","Course à pied",8000,{"$f":"H157*1.1","v":8800},{"$f":"H157*0.9","v":7200},4.5,"Min/km",4.4999999999999997E-3,{"$f":"H157*M157","v":36},{"$f":"N157*1.25","v":45},{"$f":"N157*1.4","v":50.4},{"$f":"O153","v":22.5},{"$f":"N157/M157","v":8000.0000000000009},{"$f":"O157/M157","v":10000},{"$f":"P157/M157","v":11200},{"$f":"IF(S153<J157,S153,J157)","v":5000},{"$f":"VLOOKUP(F157,AGE!F:J,4,FALSE)","v":2003},{"$f":"VLOOKUP(F157,AGE!F:J,5,FALSE)","v":1922},null,0,0]
[40,70,2,"40702","Cross Duathlon","Distance M","Vélo",22000,{"$f":"H158*1.1","v":24200.000000000004},{"$f":"H158*0.9","v":19800},15,"Km/h",4.0000000000000001E-3,{"$f":"H158*M158","v":88},{"$f":"N158*1.25","v":110},123.19999999999999,{"$f":"O154","v":55},{"$f":"N158/M158","v":22000},{"$f":"O158/M158","v":27500},{"$f":"P158/M158","v":30799.999999999996},{"$f":"IF(S154<J158,S154,J158)","v":13750},{"$f":"VLOOKUP(F158,AGE!F:J,4,FALSE)","v":2003},{"$f":"VLOOKUP(F158,AGE!F:J,5,FALSE)","v":1922},null,0,0]
[40,70,3,"40703","Cross Duathlon","Distance M","Course à pied",4000,4400,3600,4.5,"Min/km",4.4999999999999997E-3,18,22.5,25.2,{"$f":"O155","v":11.25},4000.0000000000005,5000,5600,2500,{"$f":"VLOOKUP(F159,AGE!F:J,4,FALSE)","v":2003},{"$f":"VLOOKUP(F159,AGE!F:J,5,FALSE)","v":1922},null,0,0]
[40,70,4,"40704","Cross Duathlon","Distance M","Total",{"$f":"+SUM(H157:H159)","v":34000},{"$f":"SUM(I157:I159)","v":37400},{"$f":"SUM(J157:J159)","v":30600},null,null,"",{"$f":"SUM(N157:N159)","v":142},{"$f":"SUM(O157:O159)","v":177.5},null,{"$f":"SUM(Q157:Q159)","v":88.75},{"$f":"SUM(R157:R159)","v":34000},{"$f":"SUM(S157:S159)","v":42500},null,{"$f":"SUM(U157:U159)","v":21250},{"$f":"VLOOKUP(F160,AGE!F:J,4,FALSE)","v":2003},{"$f":"VLOOKUP(F160,AGE!F:J,5,FALSE)","v":1922},null,0,0]
[40,80,1,"40801","Cross Duathlon","Distance L","Course à pied",16000,{"$f":"H161*1.1","v":17600},{"$f":"H161*0.9","v":14400},4.5,"Min/km",{"$f":"IF(L161=\"Sec/100m\",((K161)/60/100),(IF(L161=\"Km/h\",60/K161/1000,(IF(L161=\"Min/km\",K161/1000,\"\")))))","v":4.4999999999999997E-3},{"$f":"H161*M161","v":72},{"$f":"N161*1.25","v":90},null,{"$f":"O157","v":45},{"$f":"N161/M161","v":16000.000000000002},{"$f":"O161/M161","v":20000},{"$f":"P161/M161","v":0},{"$f":"IF(S157<J161,S157,J161)","v":10000},{"$f":"VLOOKUP(F161,AGE!F:J,4,FALSE)","v":2003},{"$f":"VLOOKUP(F161,AGE!F:J,5,FALSE)","v":1922},null,0,0]
[40,80,2,"40802","Cross Duathlon","Distance L","Cyclisme",44000,{"$f":"H162*1.1","v":48400.000000000007},{"$f":"H162*0.9","v":39600},15,"Km/h",4.0000000000000001E-3,{"$f":"H162*M162","v":176},{"$f":"N162*1.25","v":220},null,{"$f":"O158","v":110},{"$f":"N162/M162","v":44000},{"$f":"O162/M162","v":55000},{"$f":"P162/M162","v":0},{"$f":"IF(S158<J162,S158,J162)","v":27500},{"$f":"VLOOKUP(F162,AGE!F:J,4,FALSE)","v":2003},{"$f":"VLOOKUP(F162,AGE!F:J,5,FALSE)","v":1922},null,0,0]
[40,80,3,"40803","Cross Duathlon","Distance L","Course à pied",8000,8800,7200,4.5,"Min/km",4.4999999999999997E-3,36,45,null,{"$f":"O159","v":22.5},8000.0000000000009,10000,0,5000,{"$f":"VLOOKUP(F163,AGE!F:J,4,FALSE)","v":2003},{"$f":"VLOOKUP(F163,AGE!F:J,5,FALSE)","v":1922},null,0,0]
[40,80,4,"40804","Cross Duathlon","Distance L","Total",{"$f":"+SUM(H161:H163)","v":68000},{"$f":"SUM(I161:I163)","v":74800},{"$f":"SUM(J161:J163)","v":61200},null,null,"",{"$f":"SUM(N161:N163)","v":284},{"$f":"SUM(O161:O163)","v":355},null,{"$f":"SUM(Q161:Q163)","v":177.5},{"$f":"SUM(R161:R163)","v":68000},{"$f":"SUM(S161:S163)","v":85000},null,{"$f":"SUM(U161:U163)","v":42500},{"$f":"VLOOKUP(F164,AGE!F:J,4,FALSE)","v":2003},{"$f":"VLOOKUP(F164,AGE!F:J,5,FALSE)","v":1922},null,0,0]
[40,90,1,"40901","Cross Duathlon","Distance XL","Course à pied",24000,{"$f":"H165*1.1","v":26400.000000000004},{"$f":"H165*0.9","v":21600},4.5,"Min/km",4.4999999999999997E-3,{"$f":"H165*M165","v":107.99999999999999},{"$f":"N165*1.25","v":134.99999999999997},null,{"$f":"O161","v":90},{"$f":"N165/M165","v":24000},{"$f":"O165/M165","v":29999.999999999996},{"$f":"P165/M165","v":0},{"$f":"(N165*0.75)/M165","v":18000},{"$f":"VLOOKUP(F165,AGE!F:J,4,FALSE)","v":2003},{"$f":"VLOOKUP(F165,AGE!F:J,5,FALSE)","v":1922},null,0,0]
[40,90,2,"40902","Cross Duathlon","Distance XL","Cyclisme",66000,{"$f":"H166*1.1","v":72600},{"$f":"H166*0.9","v":59400},15,"Km/h",4.0000000000000001E-3,{"$f":"H166*M166","v":264},{"$f":"N166*1.25","v":330},null,{"$f":"O162","v":220},{"$f":"N166/M166","v":66000},{"$f":"O166/M166","v":82500},{"$f":"P166/M166","v":0},49500,{"$f":"VLOOKUP(F166,AGE!F:J,4,FALSE)","v":2003},{"$f":"VLOOKUP(F166,AGE!F:J,5,FALSE)","v":1922},null,0,0]
[40,90,3,"40903","Cross Duathlon","Distance XL","Course à pied",12000,13200.000000000002,10800,4.5,"Min/km",4.4999999999999997E-3,{"$f":"H167*M167","v":53.999999999999993},67.499999999999986,null,{"$f":"O163","v":45},12000,14999.999999999998,0,9000,{"$f":"VLOOKUP(F167,AGE!F:J,4,FALSE)","v":2003},{"$f":"VLOOKUP(F167,AGE!F:J,5,FALSE)","v":1922},null,0,0]
[40,90,4,"40904","Cross Duathlon","Distance XL","Total",{"$f":"+SUM(H165:H167)","v":102000},{"$f":"SUM(I165:I167)","v":112200},{"$f":"SUM(J165:J167)","v":91800},null,null,"",{"$f":"SUM(N165:N167)","v":426},{"$f":"SUM(O165:O167)","v":532.5},null,{"$f":"SUM(Q165:Q167)","v":355},{"$f":"SUM(R165:R167)","v":102000},{"$f":"SUM(S165:S167)","v":127500},null,{"$f":"SUM(U165:U167)","v":76500},{"$f":"VLOOKUP(F168,AGE!F:J,4,FALSE)","v":2003},{"$f":"VLOOKUP(F168,AGE!F:J,5,FALSE)","v":1922},null,0,0]
[50,10,1,"50101","Aquathlon","Jeune 6-9","Natation",50,{"$f":"H169*1.1","v":55.000000000000007},{"$f":"H169*0.9","v":45},{"$f":"60+50","v":110},"Sec/100m",1.8333333333333333E-2,{"$f":"H169*M169","v":0.91666666666666663},{"$f":"N169*1.25","v":1.1458333333333333},{"$f":"N169*1.4","v":1.2833333333333332},null,{"$f":"N169/M169","v":50},{"$f":"O169/M169","v":62.499999999999993},{"$f":"P169/M169","v":70},{"$f":"+R169/2","v":25},{"$f":"VLOOKUP(F169,AGE!F:J,4,FALSE)","v":2015},{"$f":"VLOOKUP(F169,AGE!F:J,5,FALSE)","v":2012},null,0,0]
[50,10,2,"50102","Aquathlon","Jeune 6-9","Course à pied",500,{"$f":"H170*1.1","v":550},{"$f":"H170*0.9","v":450},5,"Min/km",5.0000000000000001E-3,{"$f":"H170*M170","v":2.5},{"$f":"N170*1.25","v":3.125},{"$f":"N170*1.4","v":3.5},null,{"$f":"N170/M170","v":500},{"$f":"O170/M170","v":625},{"$f":"P170/M170","v":700},{"$f":"+R170/2","v":250},{"$f":"VLOOKUP(F170,AGE!F:J,4,FALSE)","v":2015},{"$f":"VLOOKUP(F170,AGE!F:J,5,FALSE)","v":2012},null,0,0]
[50,10,3,"50103","Aquathlon","Jeune 6-9",null,null,null,null,null,null,null,null,null,null,null,null,null,null,null,{"$f":"VLOOKUP(F171,AGE!F:J,4,FALSE)","v":2015},{"$f":"VLOOKUP(F171,AGE!F:J,5,FALSE)","v":2012},null,0,0]
[50,10,4,"50104","Aquathlon","Jeune 6-9","Total",{"$f":"+SUM(H169:H171)","v":550},{"$f":"SUM(I169:I171)","v":605},{"$f":"SUM(J169:J171)","v":495},null,null,{"$f":"IF(L172=\"Sec/100m\",((K172)/60/100),(IF(L172=\"Km/h\",60/K172/1000,(IF(L172=\"Min/km\",K172/1000,\"\")))))","v":""},{"$f":"SUM(N169:N171)","v":3.4166666666666665},{"$f":"SUM(O169:O171)","v":4.270833333333333},null,{"$f":"SUM(Q169:Q171)","v":0},{"$f":"SUM(R169:R171)","v":550},{"$f":"SUM(S169:S171)","v":687.5},null,{"$f":"SUM(U169:U171)","v":275},{"$f":"VLOOKUP(F172,AGE!F:J,4,FALSE)","v":2015},{"$f":"VLOOKUP(F172,AGE!F:J,5,FALSE)","v":2012},null,0,0]
[50,20,1,"50201","Aquathlon","Jeune 8-11","Natation",100,{"$f":"H173*1.1","v":110.00000000000001},{"$f":"H173*0.9","v":90},{"$f":"60+50","v":110},"Sec/100m",{"$f":"IF(L173=\"Sec/100m\",((K173)/60/100),(IF(L173=\"Km/h\",60/K173/1000,(IF(L173=\"Min/km\",K173/1000,\"\")))))","v":1.8333333333333333E-2},{"$f":"H173*M173","v":1.8333333333333333},{"$f":"N173*1.25","v":2.2916666666666665},{"$f":"N173*1.4","v":2.5666666666666664},{"$f":"O169","v":1.1458333333333333},{"$f":"N173/M173","v":100},{"$f":"O173/M173","v":124.99999999999999},{"$f":"P173/M173","v":140},{"$f":"IF(S169<J173,S169,J173)","v":62.499999999999993},{"$f":"VLOOKUP(F173,AGE!F:J,4,FALSE)","v":2013},{"$f":"VLOOKUP(F173,AGE!F:J,5,FALSE)","v":2010},null,0,0]
[50,20,2,"50202","Aquathlon","Jeune 8-11","Course à pied",1000,{"$f":"H174*1.1","v":1100},{"$f":"H174*0.9","v":900},5,"Min/km",5.0000000000000001E-3,{"$f":"H174*M174","v":5},{"$f":"N174*1.25","v":6.25},{"$f":"N174*1.4","v":7},{"$f":"O170","v":3.125},{"$f":"N174/M174","v":1000},{"$f":"O174/M174","v":1250},{"$f":"P174/M174","v":1400},{"$f":"IF(S170<J174,S170,J174)","v":625},{"$f":"VLOOKUP(F174,AGE!F:J,4,FALSE)","v":2013},{"$f":"VLOOKUP(F174,AGE!F:J,5,FALSE)","v":2010},null,0,0]
[50,20,3,{"$f":"CONCATENATE(A175,B175,C175)","v":"50203"},"Aquathlon","Jeune 8-11",null,null,null,null,null,null,null,null,null,null,null,null,null,null,0,{"$f":"VLOOKUP(F175,AGE!F:J,4,FALSE)","v":2013},{"$f":"VLOOKUP(F175,AGE!F:J,5,FALSE)","v":2010},null,{"$f":"IF(U175>R175,\"Attention dist basse assimilée > distance officielle\",)","v":0},0]
[50,20,4,"50204","Aquathlon","Jeune 8-11","Total",{"$f":"+SUM(H173:H175)","v":1100},{"$f":"SUM(I173:I175)","v":1210},{"$f":"SUM(J173:J175)","v":990},null,null,{"$f":"IF(L176=\"Sec/100m\",((K176)/60/100),(IF(L176=\"Km/h\",60/K176/1000,(IF(L176=\"Min/km\",K176/1000,\"\")))))","v":""},{"$f":"SUM(N173:N175)","v":6.833333333333333},{"$f":"SUM(O173:O175)","v":8.5416666666666661},null,{"$f":"SUM(Q173:Q175)","v":4.270833333333333},{"$f":"SUM(R173:R175)","v":1100},{"$f":"SUM(S173:S175)","v":1375},null,{"$f":"SUM(U173:U175)","v":687.5},{"$f":"VLOOKUP(F176,AGE!F:J,4,FALSE)","v":2013},{"$f":"VLOOKUP(F176,AGE!F:J,5,FALSE)","v":2010},null,0,0]
[50,30,1,"50301","Aquathlon","Jeune 10-13","Natation",200,{"$f":"H177*1.1","v":220.00000000000003},{"$f":"H177*0.9","v":180},{"$f":"60+50","v":110},"Sec/100m",1.8333333333333333E-2,{"$f":"H177*M177","v":3.6666666666666665},{"$f":"N177*1.25","v":4.583333333333333},{"$f":"N177*1.4","v":5.1333333333333329},{"$f":"O173","v":2.2916666666666665},{"$f":"N177/M177","v":200},{"$f":"O177/M177","v":249.99999999999997},{"$f":"P177/M177","v":280},{"$f":"IF(S173<J177,S173,J177)","v":124.99999999999999},{"$f":"VLOOKUP(F177,AGE!F:J,4,FALSE)","v":2011},{"$f":"VLOOKUP(F177,AGE!F:J,5,FALSE)","v":2008},null,0,0]
[50,30,2,"50302","Aquathlon","Jeune 10-13","Course à pied",1500,{"$f":"H178*1.1","v":1650.0000000000002},{"$f":"H178*0.9","v":1350},5,"Min/km",5.0000000000000001E-3,{"$f":"H178*M178","v":7.5},{"$f":"N178*1.25","v":9.375},{"$f":"N178*1.4","v":10.5},{"$f":"O174","v":6.25},{"$f":"N178/M178","v":1500},{"$f":"O178/M178","v":1875},{"$f":"P178/M178","v":2100},{"$f":"IF(S174<J178,S174,J178)","v":1250},{"$f":"VLOOKUP(F178,AGE!F:J,4,FALSE)","v":2011},{"$f":"VLOOKUP(F178,AGE!F:J,5,FALSE)","v":2008},null,0,0]
[50,30,3,{"$f":"CONCATENATE(A179,B179,C179)","v":"50303"},"Aquathlon","Jeune 10-13",null,null,null,null,null,null,null,null,null,null,null,null,null,null,0,{"$f":"VLOOKUP(F179,AGE!F:J,4,FALSE)","v":2011},{"$f":"VLOOKUP(F179,AGE!F:J,5,FALSE)","v":2008},null,0,0]
[50,30,4,"50304","Aquathlon","Jeune 10-13","Total",{"$f":"+SUM(H177:H179)","v":1700},{"$f":"SUM(I177:I179)","v":1870.0000000000002},{"$f":"SUM(J177:J179)","v":1530},null,null,{"$f":"IF(L180=\"Sec/100m\",((K180)/60/100),(IF(L180=\"Km/h\",60/K180/1000,(IF(L180=\"Min/km\",K180/1000,\"\")))))","v":""},{"$f":"SUM(N177:N179)","v":11.166666666666666},{"$f":"SUM(O177:O179)","v":13.958333333333332},null,{"$f":"SUM(Q177:Q179)","v":8.5416666666666661},{"$f":"SUM(R177:R179)","v":1700},{"$f":"SUM(S177:S179)","v":2125},null,{"$f":"SUM(U177:U179)","v":1375},{"$f":"VLOOKUP(F180,AGE!F:J,4,FALSE)","v":2011},{"$f":"VLOOKUP(F180,AGE!F:J,5,FALSE)","v":2008},null,0,0]
[50,40,1,"50401","Aquathlon","Jeune 12-19","Natation",300,{"$f":"H181*1.1","v":330},{"$f":"H181*0.9","v":270},{"$f":"60+50","v":110},"Sec/100m",1.8333333333333333E-2,{"$f":"H181*M181","v":5.5},{"$f":"N181*1.25","v":6.875},{"$f":"N181*1.4","v":7.6999999999999993},{"$f":"O177","v":4.583333333333333},{"$f":"N181/M181","v":300},{"$f":"O181/M181","v":375},{"$f":"P181/M181","v":419.99999999999994},{"$f":"IF(S177<J181,S177,J181)","v":249.99999999999997},{"$f":"VLOOKUP(F181,AGE!F:J,4,FALSE)","v":2009},{"$f":"VLOOKUP(F181,AGE!F:J,5,FALSE)","v":2002},null,0,0]
[50,40,2,"50402","Aquathlon","Jeune 12-19","Course à pied",2000,{"$f":"H182*1.1","v":2200},{"$f":"H182*0.9","v":1800},5,"Min/km",5.0000000000000001E-3,{"$f":"H182*M182","v":10},{"$f":"N182*1.25","v":12.5},{"$f":"N182*1.4","v":14},{"$f":"O178","v":9.375},{"$f":"N182/M182","v":2000},{"$f":"O182/M182","v":2500},{"$f":"P182/M182","v":2800},{"$f":"IF(S178<J182,S178,J182)","v":1800},{"$f":"VLOOKUP(F182,AGE!F:J,4,FALSE)","v":2009},{"$f":"VLOOKUP(F182,AGE!F:J,5,FALSE)","v":2002},null,0,{"$f":"IF(U182>J182,\"Attention dist basse assimilée > distance officielle tolérance 10%\",)","v":0}]
[50,40,3,"50403","Aquathlon","Jeune 12-19",null,null,null,null,null,null,null,null,null,null,null,null,null,null,0,{"$f":"VLOOKUP(F183,AGE!F:J,4,FALSE)","v":2009},{"$f":"VLOOKUP(F183,AGE!F:J,5,FALSE)","v":2002},null,0,{"$f":"IF(U183>J183,\"Attention dist basse assimilée > distance officielle tolérance 10%\",)","v":0}]
[50,40,4,"50404","Aquathlon","Jeune 12-19","Total",{"$f":"+SUM(H181:H183)","v":2300},{"$f":"SUM(I181:I183)","v":2530},{"$f":"SUM(J181:J183)","v":2070},null,null,{"$f":"IF(L184=\"Sec/100m\",((K184)/60/100),(IF(L184=\"Km/h\",60/K184/1000,(IF(L184=\"Min/km\",K184/1000,\"\")))))","v":""},{"$f":"SUM(N181:N183)","v":15.5},{"$f":"SUM(O181:O183)","v":19.375},null,{"$f":"SUM(Q181:Q183)","v":13.958333333333332},{"$f":"SUM(R181:R183)","v":2300},{"$f":"SUM(S181:S183)","v":2875},null,{"$f":"SUM(U181:U183)","v":2050},{"$f":"VLOOKUP(F184,AGE!F:J,4,FALSE)","v":2009},{"$f":"VLOOKUP(F184,AGE!F:J,5,FALSE)","v":2002},null,0,0]
[50,41,1,"50411","Aquathlon","Distance XXS","Natation",250,{"$f":"H185*1.1","v":275},{"$f":"H185*0.9","v":225},105,"Sec/100m",1.7500000000000002E-2,{"$f":"H185*M185","v":4.375},{"$f":"N185*1.25","v":5.46875},{"$f":"N185*1.4","v":6.125},{"$f":"O177","v":4.583333333333333},{"$f":"N185/M185","v":249.99999999999997},{"$f":"O185/M185","v":312.49999999999994},{"$f":"P185/M185","v":349.99999999999994},{"$f":"(N185*0.5)/M185","v":124.99999999999999},{"$f":"VLOOKUP(F185,AGE!F:J,4,FALSE)","v":2009},{"$f":"VLOOKUP(F185,AGE!F:J,5,FALSE)","v":1922},null,{"$f":"IF(U185>R185,\"Attention dist basse assimilée > distance officielle\",)","v":0},{"$f":"IF(U185>J185,\"Attention dist basse assimilée > distance officielle tolérance 10%\",)","v":0}]
[50,41,2,"50412","Aquathlon","Distance XXS","Course à pied",1500,{"$f":"H186*1.1","v":1650.0000000000002},{"$f":"H186*0.9","v":1350},4.5,"Min/km",4.4999999999999997E-3,{"$f":"H186*M186","v":6.7499999999999991},{"$f":"N186*1.25","v":8.4374999999999982},{"$f":"N186*1.4","v":9.4499999999999975},{"$f":"O178","v":9.375},{"$f":"N186/M186","v":1500},{"$f":"O186/M186","v":1874.9999999999998},{"$f":"P186/M186","v":2099.9999999999995},{"$f":"(N186*0.5)/M186","v":750},{"$f":"VLOOKUP(F186,AGE!F:J,4,FALSE)","v":2009},{"$f":"VLOOKUP(F186,AGE!F:J,5,FALSE)","v":1922},null,0,0]
[50,41,3,"50413","Aquathlon","Distance XXS",null,null,null,null,null,null,null,null,null,null,null,null,null,null,null,{"$f":"VLOOKUP(F187,AGE!F:J,4,FALSE)","v":2009},{"$f":"VLOOKUP(F187,AGE!F:J,5,FALSE)","v":1922},null,0,0]
[50,41,4,"50414","Aquathlon","Distance XXS","Total",{"$f":"+SUM(H185:H187)","v":1750},{"$f":"SUM(I185:I187)","v":1925.0000000000002},{"$f":"SUM(J185:J187)","v":1575},null,null,{"$f":"IF(L188=\"Sec/100m\",((K188)/60/100),(IF(L188=\"Km/h\",60/K188/1000,(IF(L188=\"Min/km\",K188/1000,\"\")))))","v":""},{"$f":"SUM(N185:N187)","v":11.125},{"$f":"SUM(O185:O187)","v":13.906249999999998},null,{"$f":"SUM(Q185:Q187)","v":13.958333333333332},{"$f":"SUM(R185:R187)","v":1750},{"$f":"SUM(S185:S187)","v":2187.4999999999995},null,{"$f":"SUM(U185:U187)","v":875},{"$f":"VLOOKUP(F188,AGE!F:J,4,FALSE)","v":2009},{"$f":"VLOOKUP(F188,AGE!F:J,5,FALSE)","v":1922},null,0,0]
[50,50,1,"50501","Aquathlon","Distance XS","Natation",500,{"$f":"H189*1.1","v":550},{"$f":"H189*0.9","v":450},105,"Sec/100m",1.7500000000000002E-2,{"$f":"H189*M189","v":8.75},{"$f":"N189*1.25","v":10.9375},{"$f":"N189*1.4","v":12.25},{"$f":"O181","v":6.875},{"$f":"N189/M189","v":499.99999999999994},{"$f":"O189/M189","v":624.99999999999989},{"$f":"P189/M189","v":699.99999999999989},{"$f":"IF(S185<J189,S185,J189)","v":312.49999999999994},{"$f":"VLOOKUP(F189,AGE!F:J,4,FALSE)","v":2009},{"$f":"VLOOKUP(F189,AGE!F:J,5,FALSE)","v":1922},null,0,0]
[50,50,2,"50502","Aquathlon","Distance XS","Course à pied",2500,{"$f":"H190*1.1","v":2750},{"$f":"H190*0.9","v":2250},4.5,"Min/km",4.4999999999999997E-3,{"$f":"H190*M190","v":11.25},{"$f":"N190*1.25","v":14.0625},{"$f":"N190*1.4","v":15.749999999999998},{"$f":"O182","v":12.5},{"$f":"N190/M190","v":2500},{"$f":"O190/M190","v":3125.0000000000005},{"$f":"P190/M190","v":3500},{"$f":"IF(S186<J190,S186,J190)","v":1874.9999999999998},{"$f":"VLOOKUP(F190,AGE!F:J,4,FALSE)","v":2009},{"$f":"VLOOKUP(F190,AGE!F:J,5,FALSE)","v":1922},null,0,0]
[50,50,3,"50503","Aquathlon","Distance XS",null,null,null,null,null,null,null,null,null,null,null,null,null,null,0,{"$f":"VLOOKUP(F191,AGE!F:J,4,FALSE)","v":2009},{"$f":"VLOOKUP(F191,AGE!F:J,5,FALSE)","v":1922},null,0,0]
[50,50,4,"50504","Aquathlon","Distance XS","Total",{"$f":"+SUM(H189:H191)","v":3000},{"$f":"SUM(I189:I191)","v":3300},{"$f":"SUM(J189:J191)","v":2700},null,null,{"$f":"IF(L192=\"Sec/100m\",((K192)/60/100),(IF(L192=\"Km/h\",60/K192/1000,(IF(L192=\"Min/km\",K192/1000,\"\")))))","v":""},{"$f":"SUM(N189:N191)","v":20},{"$f":"SUM(O189:O191)","v":25},null,{"$f":"SUM(Q189:Q191)","v":19.375},{"$f":"SUM(R189:R191)","v":3000},{"$f":"SUM(S189:S191)","v":3750.0000000000005},null,{"$f":"SUM(U189:U191)","v":2187.4999999999995},{"$f":"VLOOKUP(F192,AGE!F:J,4,FALSE)","v":2009},{"$f":"VLOOKUP(F192,AGE!F:J,5,FALSE)","v":1922},null,0,0]
[50,60,1,"50601","Aquathlon","Distance S","Natation",1000,{"$f":"H193*1.1","v":1100},{"$f":"H193*0.9","v":900},105,"Sec/100m",{"$f":"IF(L193=\"Sec/100m\",((K193)/60/100),(IF(L193=\"Km/h\",60/K193/1000,(IF(L193=\"Min/km\",K193/1000,\"\")))))","v":1.7500000000000002E-2},{"$f":"H193*M193","v":17.5},{"$f":"N193*1.25","v":21.875},{"$f":"N193*1.4","v":24.5},{"$f":"O189","v":10.9375},{"$f":"N193/M193","v":999.99999999999989},{"$f":"O193/M193","v":1249.9999999999998},{"$f":"P193/M193","v":1399.9999999999998},{"$f":"IF(S189<J193,S189,J193)","v":624.99999999999989},{"$f":"VLOOKUP(F193,AGE!F:J,4,FALSE)","v":2005},{"$f":"VLOOKUP(F193,AGE!F:J,5,FALSE)","v":1922},null,0,0]
[50,60,2,"50602","Aquathlon","Distance S","Course à pied",5000,{"$f":"H194*1.1","v":5500},{"$f":"H194*0.9","v":4500},4.5,"Min/km",4.4999999999999997E-3,{"$f":"H194*M194","v":22.5},{"$f":"N194*1.25","v":28.125},{"$f":"N194*1.4","v":31.499999999999996},{"$f":"O190","v":14.0625},{"$f":"N194/M194","v":5000},{"$f":"O194/M194","v":6250.0000000000009},{"$f":"P194/M194","v":7000},{"$f":"IF(S190<J194,S190,J194)","v":3125.0000000000005},{"$f":"VLOOKUP(F194,AGE!F:J,4,FALSE)","v":2005},{"$f":"VLOOKUP(F194,AGE!F:J,5,FALSE)","v":1922},null,0,0]
[50,60,3,"50603","Aquathlon","Distance S",null,null,null,null,null,null,null,null,null,null,null,null,null,null,0,{"$f":"VLOOKUP(F195,AGE!F:J,4,FALSE)","v":2005},{"$f":"VLOOKUP(F195,AGE!F:J,5,FALSE)","v":1922},null,0,0]
[50,60,4,"50604","Aquathlon","Distance S","Total",{"$f":"+SUM(H193:H195)","v":6000},{"$f":"SUM(I193:I195)","v":6600},{"$f":"SUM(J193:J195)","v":5400},null,null,{"$f":"IF(L196=\"Sec/100m\",((K196)/60/100),(IF(L196=\"Km/h\",60/K196/1000,(IF(L196=\"Min/km\",K196/1000,\"\")))))","v":""},{"$f":"SUM(N193:N195)","v":40},{"$f":"SUM(O193:O195)","v":50},null,{"$f":"SUM(Q193:Q195)","v":25},{"$f":"SUM(R193:R195)","v":6000},{"$f":"SUM(S193:S195)","v":7500.0000000000009},null,{"$f":"SUM(U193:U195)","v":3750.0000000000005},{"$f":"VLOOKUP(F196,AGE!F:J,4,FALSE)","v":2005},{"$f":"VLOOKUP(F196,AGE!F:J,5,FALSE)","v":1922},null,0,0]
[50,70,1,"50701","Aquathlon","Distance M","Natation",2000,{"$f":"H197*1.1","v":2200},{"$f":"H197*0.9","v":1800},105,"Sec/100m",1.7500000000000002E-2,{"$f":"H197*M197","v":35},{"$f":"N197*1.25","v":43.75},{"$f":"N197*1.4","v":49},{"$f":"O193","v":21.875},{"$f":"N197/M197","v":1999.9999999999998},{"$f":"O197/M197","v":2499.9999999999995},{"$f":"P197/M197","v":2799.9999999999995},{"$f":"IF(S193<J197,S193,J197)","v":1249.9999999999998},{"$f":"VLOOKUP(F197,AGE!F:J,4,FALSE)","v":2003},{"$f":"VLOOKUP(F197,AGE!F:J,5,FALSE)","v":1922},null,0,0]
[50,70,2,"50702","Aquathlon","Distance M","Course à pied",10000,{"$f":"H198*1.1","v":11000},{"$f":"H198*0.9","v":9000},4.5,"Min/km",4.4999999999999997E-3,{"$f":"H198*M198","v":45},{"$f":"N198*1.25","v":56.25},{"$f":"N198*1.4","v":62.999999999999993},{"$f":"O194","v":28.125},{"$f":"N198/M198","v":10000},{"$f":"O198/M198","v":12500.000000000002},{"$f":"P198/M198","v":14000},{"$f":"IF(S194<J198,S194,J198)","v":6250.0000000000009},{"$f":"VLOOKUP(F198,AGE!F:J,4,FALSE)","v":2003},{"$f":"VLOOKUP(F198,AGE!F:J,5,FALSE)","v":1922},null,0,0]
[50,70,3,"50703","Aquathlon","Distance M",null,null,null,null,null,null,null,null,null,null,null,null,null,null,0,{"$f":"VLOOKUP(F199,AGE!F:J,4,FALSE)","v":2003},{"$f":"VLOOKUP(F199,AGE!F:J,5,FALSE)","v":1922},null,0,0]
[50,70,4,"50704","Aquathlon","Distance M","Total",{"$f":"+SUM(H197:H199)","v":12000},{"$f":"SUM(I197:I199)","v":13200},{"$f":"SUM(J197:J199)","v":10800},null,null,{"$f":"IF(L200=\"Sec/100m\",((K200)/60/100),(IF(L200=\"Km/h\",60/K200/1000,(IF(L200=\"Min/km\",K200/1000,\"\")))))","v":""},{"$f":"SUM(N197:N199)","v":80},{"$f":"SUM(O197:O199)","v":100},null,{"$f":"SUM(Q197:Q199)","v":50},{"$f":"SUM(R197:R199)","v":12000},{"$f":"SUM(S197:S199)","v":15000.000000000002},null,{"$f":"SUM(U197:U199)","v":7500.0000000000009},{"$f":"VLOOKUP(F200,AGE!F:J,4,FALSE)","v":2003},{"$f":"VLOOKUP(F200,AGE!F:J,5,FALSE)","v":1922},null,0,0]
[50,80,1,"50801","Aquathlon","Distance L","Natation",3000,{"$f":"H201*1.1","v":3300.0000000000005},{"$f":"H201*0.9","v":2700},105,"Sec/100m",1.7500000000000002E-2,{"$f":"H201*M201","v":52.500000000000007},{"$f":"N201*1.25","v":65.625000000000014},null,{"$f":"O197","v":43.75},{"$f":"N201/M201","v":3000},{"$f":"O201/M201","v":3750.0000000000005},{"$f":"P201/M201","v":0},{"$f":"IF(S197<J201,S197,J201)","v":2499.9999999999995},{"$f":"VLOOKUP(F201,AGE!F:J,4,FALSE)","v":2003},{"$f":"VLOOKUP(F201,AGE!F:J,5,FALSE)","v":1922},null,0,0]
[50,80,2,"50802","Aquathlon","Distance L","Course à pied",15000,{"$f":"H202*1.1","v":16500},{"$f":"H202*0.9","v":13500},4.5,"Min/km",4.4999999999999997E-3,{"$f":"H202*M202","v":67.5},{"$f":"N202*1.25","v":84.375},null,{"$f":"O198","v":56.25},{"$f":"N202/M202","v":15000.000000000002},{"$f":"O202/M202","v":18750},{"$f":"P202/M202","v":0},{"$f":"IF(S198<J202,S198,J202)","v":12500.000000000002},{"$f":"VLOOKUP(F202,AGE!F:J,4,FALSE)","v":2003},{"$f":"VLOOKUP(F202,AGE!F:J,5,FALSE)","v":1922},null,0,0]
[50,80,3,{"$f":"CONCATENATE(A203,B203,C203)","v":"50803"},"Aquathlon","Distance L",null,null,null,null,null,null,null,null,null,null,null,null,null,null,0,{"$f":"VLOOKUP(F203,AGE!F:J,4,FALSE)","v":2003},{"$f":"VLOOKUP(F203,AGE!F:J,5,FALSE)","v":1922},null,0,0]
[50,80,4,"50804","Aquathlon","Distance L","Total",{"$f":"+SUM(H201:H203)","v":18000},{"$f":"SUM(I201:I203)","v":19800},{"$f":"SUM(J201:J203)","v":16200},null,null,{"$f":"IF(L204=\"Sec/100m\",((K204)/60/100),(IF(L204=\"Km/h\",60/K204/1000,(IF(L204=\"Min/km\",K204/1000,\"\")))))","v":""},{"$f":"SUM(N201:N203)","v":120},{"$f":"SUM(O201:O203)","v":150},null,{"$f":"SUM(Q201:Q203)","v":100},{"$f":"SUM(R201:R203)","v":18000},{"$f":"SUM(S201:S203)","v":22500},null,{"$f":"SUM(U201:U203)","v":15000.000000000002},{"$f":"VLOOKUP(F204,AGE!F:J,4,FALSE)","v":2003},{"$f":"VLOOKUP(F204,AGE!F:J,5,FALSE)","v":1922},null,0,0]
[50,90,1,"50901","Aquathlon","Distance XL","Natation",4000,{"$f":"H205*1.1","v":4400},{"$f":"H205*0.9","v":3600},105,"Sec/100m",1.7500000000000002E-2,{"$f":"H205*M205","v":70},{"$f":"N205*1.25","v":87.5},null,{"$f":"O201","v":65.625000000000014},{"$f":"N205/M205","v":3999.9999999999995},{"$f":"O205/M205","v":4999.9999999999991},{"$f":"P205/M205","v":0},{"$f":"(N205*0.75)/M205","v":2999.9999999999995},{"$f":"VLOOKUP(F205,AGE!F:J,4,FALSE)","v":2003},{"$f":"VLOOKUP(F205,AGE!F:J,5,FALSE)","v":1922},null,0,0]
[50,90,2,"50902","Aquathlon","Distance XL","Course à pied",20000,{"$f":"H206*1.1","v":22000},{"$f":"H206*0.9","v":18000},4.5,"Min/km",4.4999999999999997E-3,{"$f":"H206*M206","v":90},{"$f":"N206*1.25","v":112.5},null,{"$f":"O202","v":84.375},{"$f":"N206/M206","v":20000},{"$f":"O206/M206","v":25000.000000000004},{"$f":"P206/M206","v":0},15000.000000000002,{"$f":"VLOOKUP(F206,AGE!F:J,4,FALSE)","v":2003},{"$f":"VLOOKUP(F206,AGE!F:J,5,FALSE)","v":1922},null,0,0]
[50,90,3,"50903","Aquathlon","Distance XL",null,null,null,null,null,null,null,null,null,null,null,null,null,null,{"$f":"S203","v":0},{"$f":"VLOOKUP(F207,AGE!F:J,4,FALSE)","v":2003},{"$f":"VLOOKUP(F207,AGE!F:J,5,FALSE)","v":1922},null,0,0]
[50,90,4,"50904","Aquathlon","Distance XL","Total",{"$f":"+SUM(H205:H207)","v":24000},{"$f":"SUM(I205:I207)","v":26400},{"$f":"SUM(J205:J207)","v":21600},null,null,{"$f":"IF(L208=\"Sec/100m\",((K208)/60/100),(IF(L208=\"Km/h\",60/K208/1000,(IF(L208=\"Min/km\",K208/1000,\"\")))))","v":""},{"$f":"SUM(N205:N207)","v":160},{"$f":"SUM(O205:O207)","v":200},null,{"$f":"SUM(Q205:Q207)","v":150},{"$f":"SUM(R205:R207)","v":24000},{"$f":"SUM(S205:S207)","v":30000.000000000004},null,{"$f":"SUM(U205:U207)","v":18000},{"$f":"VLOOKUP(F208,AGE!F:J,4,FALSE)","v":2003},{"$f":"VLOOKUP(F208,AGE!F:J,5,FALSE)","v":1922},null,0,0]
[60,10,1,"60101","Bike and Run","Jeune 6-9","Bike and Run",null,null,null,null,null,null,{"$f":"(O209+Q209)/2","v":9},12,null,6,null,null,null,null,{"$f":"VLOOKUP(F209,AGE!F:J,4,FALSE)","v":2015},{"$f":"VLOOKUP(F209,AGE!F:J,5,FALSE)","v":2012},null,0,0]
[60,20,1,"60201","Bike and Run","Jeune 8-11","Bike and Run",null,null,null,null,null,null,15,18,null,12,null,null,null,null,{"$f":"VLOOKUP(F210,AGE!F:J,4,FALSE)","v":2013},{"$f":"VLOOKUP(F210,AGE!F:J,5,FALSE)","v":2010},null,0,0]
[60,30,1,"60301","Bike and Run","Jeune 10-13","Bike and Run",null,null,null,null,null,null,21,24,null,{"$f":"+O210","v":18},null,null,null,null,{"$f":"VLOOKUP(F211,AGE!F:J,4,FALSE)","v":2011},{"$f":"VLOOKUP(F211,AGE!F:J,5,FALSE)","v":2008},null,0,0]
[60,40,1,"60401","Bike and Run","Jeune 12-19","Bike and Run",null,null,null,null,null,null,27,30,null,{"$f":"+O211","v":24},null,null,null,null,{"$f":"VLOOKUP(F212,AGE!F:J,4,FALSE)","v":2009},{"$f":"VLOOKUP(F212,AGE!F:J,5,FALSE)","v":2002},null,0,0]
[60,41,1,"60411","Bike and Run","Distance XXS","Bike and Run",null,null,null,null,null,null,15,30,null,0,null,null,null,null,{"$f":"VLOOKUP(F213,AGE!F:J,4,FALSE)","v":2009},{"$f":"VLOOKUP(F213,AGE!F:J,5,FALSE)","v":1922},null,{"$f":"IF(U213>R213,\"Attention dist basse assimilée > distance officielle\",)","v":0},{"$f":"IF(U213>J213,\"Attention dist basse assimilée > distance officielle tolérance 10%\",)","v":0}]
[60,50,1,"60501","Bike and Run","Distance XS","Bike and Run",null,null,null,null,null,null,37.5,45,null,{"$f":"O213","v":30},null,null,null,null,{"$f":"VLOOKUP(F214,AGE!F:J,4,FALSE)","v":2009},{"$f":"VLOOKUP(F214,AGE!F:J,5,FALSE)","v":1922},null,0,0]
[60,60,1,"60601","Bike and Run","Distance S","Bike and Run",null,null,null,null,null,null,60,75,null,{"$f":"+O214","v":45},null,null,null,null,{"$f":"VLOOKUP(F215,AGE!F:J,4,FALSE)","v":2005},{"$f":"VLOOKUP(F215,AGE!F:J,5,FALSE)","v":1922},null,0,0]
[60,70,1,"60701","Bike and Run","Distance M","Bike and Run",null,null,null,null,null,null,97.5,120,null,75,null,null,null,null,{"$f":"VLOOKUP(F216,AGE!F:J,4,FALSE)","v":2003},{"$f":"VLOOKUP(F216,AGE!F:J,5,FALSE)","v":1922},null,0,0]
[60,80,1,"60801","Bike and Run","Distance L","Bike and Run",null,null,null,null,null,null,160,200,null,{"$f":"+O216","v":120},null,null,null,null,{"$f":"VLOOKUP(F217,AGE!F:J,4,FALSE)","v":2003},{"$f":"VLOOKUP(F217,AGE!F:J,5,FALSE)","v":1922},null,0,0]
[70,50,1,"70501","Triathon des neiges","Distance XS","Course à pied",2000,{"$f":"H218*1.1","v":2200},{"$f":"H218*0.9","v":1800},4.5,"Min/km",{"$f":"IF(L218=\"Sec/100m\",((K218)/60/100),(IF(L218=\"Km/h\",60/K218/1000,(IF(L218=\"Min/km\",K218/1000,\"\")))))","v":4.4999999999999997E-3},{"$f":"H218*M218","v":9},{"$f":"N218*1.25","v":11.25},{"$f":"N218*1.4","v":12.6},{"$f":"O214","v":45},{"$f":"N218/M218","v":2000.0000000000002},{"$f":"O218/M218","v":2500},{"$f":"P218/M218","v":2800},{"$f":"(N218*0.5)/M218","v":1000.0000000000001},{"$f":"VLOOKUP(F218,AGE!F:J,4,FALSE)","v":2009},{"$f":"VLOOKUP(F218,AGE!F:J,5,FALSE)","v":1922},null,0,0]
[70,50,2,"70502","Triathon des neiges","Distance XS","Cyclisme",3500,3850.0000000000005,3150,15,"Km/h",4.0000000000000001E-3,14,17.5,19.599999999999998,{"$f":"O215","v":75},3500,4375,4899.9999999999991,{"$f":"(N219*0.5)/M219","v":1750},{"$f":"VLOOKUP(F219,AGE!F:J,4,FALSE)","v":2009},{"$f":"VLOOKUP(F219,AGE!F:J,5,FALSE)","v":1922},null,0,0]
[70,50,3,"70503","Triathon des neiges","Distance XS","Ski de Fond",3000,3300.0000000000005,2700,4.5,"Min/km",4.4999999999999997E-3,13.499999999999998,16.874999999999996,18.899999999999995,{"$f":"O216","v":120},3000,3749.9999999999995,4199.9999999999991,1500,{"$f":"VLOOKUP(F220,AGE!F:J,4,FALSE)","v":2009},{"$f":"VLOOKUP(F220,AGE!F:J,5,FALSE)","v":1922},null,0,0]
[70,50,4,{"$f":"CONCATENATE(A221,B221,C221)","v":"70504"},"Triathon des neiges","Distance XS","Total",{"$f":"+SUM(H218:H220)","v":8500},{"$f":"SUM(I218:I220)","v":9350},{"$f":"SUM(J218:J220)","v":7650},null,null,"",{"$f":"SUM(N218:N220)","v":36.5},{"$f":"SUM(O218:O220)","v":45.625},null,{"$f":"SUM(Q218:Q220)","v":240},{"$f":"SUM(R218:R220)","v":8500},{"$f":"SUM(S218:S220)","v":10625},null,{"$f":"SUM(U218:U220)","v":4250},{"$f":"VLOOKUP(F221,AGE!F:J,4,FALSE)","v":2009},{"$f":"VLOOKUP(F221,AGE!F:J,5,FALSE)","v":1922},null,0,0]
[70,60,1,"70601","Triathon des neiges","Distance S","Course à pied",4000,{"$f":"H222*1.1","v":4400},{"$f":"H222*0.9","v":3600},4.5,"Min/km",{"$f":"IF(L222=\"Sec/100m\",((K222)/60/100),(IF(L222=\"Km/h\",60/K222/1000,(IF(L222=\"Min/km\",K222/1000,\"\")))))","v":4.4999999999999997E-3},{"$f":"H222*M222","v":18},{"$f":"N222*1.25","v":22.5},{"$f":"N222*1.4","v":25.2},{"$f":"O218","v":11.25},{"$f":"N222/M222","v":4000.0000000000005},{"$f":"O222/M222","v":5000},{"$f":"P222/M222","v":5600},{"$f":"IF(S218<J222,S218,J222)","v":2500},{"$f":"VLOOKUP(F222,AGE!F:J,4,FALSE)","v":2005},{"$f":"VLOOKUP(F222,AGE!F:J,5,FALSE)","v":1922},null,0,0]
[70,60,2,"70602","Triathon des neiges","Distance S","Cyclisme",7000,7700.0000000000009,6300,15,"Km/h",4.0000000000000001E-3,28,35,39.199999999999996,{"$f":"O219","v":17.5},7000,8750,9799.9999999999982,{"$f":"IF(S219<J223,S219,J223)","v":4375},{"$f":"VLOOKUP(F223,AGE!F:J,4,FALSE)","v":2005},{"$f":"VLOOKUP(F223,AGE!F:J,5,FALSE)","v":1922},null,0,0]
[70,60,3,"70603","Triathon des neiges","Distance S","Ski de Fond",6000,6600.0000000000009,5400,4.5,"Min/km",4.4999999999999997E-3,26.999999999999996,33.749999999999993,37.79999999999999,{"$f":"O220","v":16.874999999999996},6000,7499.9999999999991,8399.9999999999982,3749.9999999999995,{"$f":"VLOOKUP(F224,AGE!F:J,4,FALSE)","v":2005},{"$f":"VLOOKUP(F224,AGE!F:J,5,FALSE)","v":1922},null,0,0]
[70,60,4,{"$f":"CONCATENATE(A225,B225,C225)","v":"70604"},"Triathon des neiges","Distance S","Total",{"$f":"+SUM(H222:H224)","v":17000},{"$f":"SUM(I222:I224)","v":18700},{"$f":"SUM(J222:J224)","v":15300},null,null,"",{"$f":"SUM(N222:N224)","v":73},{"$f":"SUM(O222:O224)","v":91.25},null,{"$f":"SUM(Q222:Q224)","v":45.625},{"$f":"SUM(R222:R224)","v":17000},{"$f":"SUM(S222:S224)","v":21250},null,{"$f":"SUM(U222:U224)","v":10625},{"$f":"VLOOKUP(F225,AGE!F:J,4,FALSE)","v":2005},{"$f":"VLOOKUP(F225,AGE!F:J,5,FALSE)","v":1922},null,0,0]
[70,70,1,"70701","Triathon des neiges","Distance M","Course à pied",8000,{"$f":"H226*1.1","v":8800},{"$f":"H226*0.9","v":7200},4.5,"Min/km",{"$f":"IF(L226=\"Sec/100m\",((K226)/60/100),(IF(L226=\"Km/h\",60/K226/1000,(IF(L226=\"Min/km\",K226/1000,\"\")))))","v":4.4999999999999997E-3},{"$f":"H226*M226","v":36},{"$f":"N226*1.25","v":45},{"$f":"N226*1.4","v":50.4},{"$f":"O222","v":22.5},{"$f":"N226/M226","v":8000.0000000000009},{"$f":"O226/M226","v":10000},{"$f":"P226/M226","v":11200},{"$f":"IF(S222<J226,S222,J226)","v":5000},{"$f":"VLOOKUP(F226,AGE!F:J,4,FALSE)","v":2003},{"$f":"VLOOKUP(F226,AGE!F:J,5,FALSE)","v":1922},null,0,0]
[70,70,2,"70702","Triathon des neiges","Distance M","Cyclisme",14000,15400.000000000002,12600,15,"Km/h",4.0000000000000001E-3,56,70,78.399999999999991,{"$f":"O223","v":35},14000,17500,19599.999999999996,{"$f":"IF(S223<J227,S223,J227)","v":8750},{"$f":"VLOOKUP(F227,AGE!F:J,4,FALSE)","v":2003},{"$f":"VLOOKUP(F227,AGE!F:J,5,FALSE)","v":1922},null,0,0]
[70,70,3,"70703","Triathon des neiges","Distance M","Ski de Fond",12000,13200.000000000002,10800,4.5,"Min/km",4.4999999999999997E-3,53.999999999999993,67.499999999999986,75.59999999999998,{"$f":"O224","v":33.749999999999993},12000,14999.999999999998,16799.999999999996,7499.9999999999991,{"$f":"VLOOKUP(F228,AGE!F:J,4,FALSE)","v":2003},{"$f":"VLOOKUP(F228,AGE!F:J,5,FALSE)","v":1922},null,0,0]
[70,70,4,{"$f":"CONCATENATE(A229,B229,C229)","v":"70704"},"Triathon des neiges","Distance M","Total",{"$f":"+SUM(H226:H228)","v":34000},{"$f":"SUM(I226:I228)","v":37400},{"$f":"SUM(J226:J228)","v":30600},null,null,"",{"$f":"SUM(N226:N228)","v":146},{"$f":"SUM(O226:O228)","v":182.5},null,{"$f":"SUM(Q226:Q228)","v":91.25},{"$f":"SUM(R226:R228)","v":34000},{"$f":"SUM(S226:S228)","v":42500},null,{"$f":"SUM(U226:U228)","v":21250},{"$f":"VLOOKUP(F229,AGE!F:J,4,FALSE)","v":2003},{"$f":"VLOOKUP(F229,AGE!F:J,5,FALSE)","v":1922},null,0,0]
[80,50,1,"80501","Duathlon des neiges","Distance XS","Course à pied",2000,{"$f":"H230*1.1","v":2200},{"$f":"H230*0.9","v":1800},4.5,"Min/km",{"$f":"IF(L230=\"Sec/100m\",((K230)/60/100),(IF(L230=\"Km/h\",60/K230/1000,(IF(L230=\"Min/km\",K230/1000,\"\")))))","v":4.4999999999999997E-3},{"$f":"H230*M230","v":9},{"$f":"N230*1.25","v":11.25},{"$f":"N230*1.4","v":12.6},{"$f":"O226","v":45},{"$f":"N230/M230","v":2000.0000000000002},{"$f":"O230/M230","v":2500},{"$f":"P230/M230","v":2800},{"$f":"(N230*0.5)/M230","v":1000.0000000000001},{"$f":"VLOOKUP(F230,AGE!F:J,4,FALSE)","v":2009},{"$f":"VLOOKUP(F230,AGE!F:J,5,FALSE)","v":1922},null,0,0]
[80,50,2,{"$f":"CONCATENATE(A231,B231,C231)","v":"80502"},"Duathlon des neiges","Distance XS","Ski de Fond",3000,3300.0000000000005,2700,4.5,"Min/km",4.4999999999999997E-3,13.499999999999998,16.874999999999996,18.899999999999995,{"$f":"O227","v":70},3000,3749.9999999999995,4199.9999999999991,{"$f":"(N231*0.5)/M231","v":1500},{"$f":"VLOOKUP(F231,AGE!F:J,4,FALSE)","v":2009},{"$f":"VLOOKUP(F231,AGE!F:J,5,FALSE)","v":1922},null,0,0]
[80,50,3,"80503","Duathlon des neiges","Distance XS","Course à pied",2000,{"$f":"H232*1.1","v":2200},{"$f":"H232*0.9","v":1800},4.5,"Min/km",{"$f":"IF(L232=\"Sec/100m\",((K232)/60/100),(IF(L232=\"Km/h\",60/K232/1000,(IF(L232=\"Min/km\",K232/1000,\"\")))))","v":4.4999999999999997E-3},{"$f":"H232*M232","v":9},{"$f":"N232*1.25","v":11.25},12.6,{"$f":"O228","v":67.499999999999986},{"$f":"N232/M232","v":2000.0000000000002},{"$f":"O232/M232","v":2500},{"$f":"P232/M232","v":2800},1000.0000000000001,{"$f":"VLOOKUP(F232,AGE!F:J,4,FALSE)","v":2009},{"$f":"VLOOKUP(F232,AGE!F:J,5,FALSE)","v":1922},null,0,0]
[80,50,4,{"$f":"CONCATENATE(A233,B233,C233)","v":"80504"},"Duathlon des neiges","Distance XS","Total",{"$f":"+SUM(H230:H232)","v":7000},{"$f":"SUM(I230:I232)","v":7700},{"$f":"SUM(J230:J232)","v":6300},null,null,"",{"$f":"SUM(N230:N232)","v":31.5},{"$f":"SUM(O230:O232)","v":39.375},null,{"$f":"SUM(Q230:Q232)","v":182.5},{"$f":"SUM(R230:R232)","v":7000},{"$f":"SUM(S230:S232)","v":8750},null,{"$f":"SUM(U230:U232)","v":3500},{"$f":"VLOOKUP(F233,AGE!F:J,4,FALSE)","v":2009},{"$f":"VLOOKUP(F233,AGE!F:J,5,FALSE)","v":1922},null,0,0]
[80,60,1,"80601","Duathlon des neiges","Distance S","Course à pied",4000,{"$f":"H234*1.1","v":4400},{"$f":"H234*0.9","v":3600},4.5,"Min/km",{"$f":"IF(L234=\"Sec/100m\",((K234)/60/100),(IF(L234=\"Km/h\",60/K234/1000,(IF(L234=\"Min/km\",K234/1000,\"\")))))","v":4.4999999999999997E-3},{"$f":"H234*M234","v":18},{"$f":"N234*1.25","v":22.5},{"$f":"N234*1.4","v":25.2},{"$f":"O230","v":11.25},{"$f":"N234/M234","v":4000.0000000000005},{"$f":"O234/M234","v":5000},{"$f":"P234/M234","v":5600},{"$f":"IF(S230<J234,S230,J234)","v":2500},{"$f":"VLOOKUP(F234,AGE!F:J,4,FALSE)","v":2005},{"$f":"VLOOKUP(F234,AGE!F:J,5,FALSE)","v":1922},null,0,0]
[80,60,2,"80602","Duathlon des neiges","Distance S","Ski de Fond",6000,6600.0000000000009,{"$f":"H235*0.9","v":5400},4.5,"Min/km",{"$f":"IF(L235=\"Sec/100m\",((K235)/60/100),(IF(L235=\"Km/h\",60/K235/1000,(IF(L235=\"Min/km\",K235/1000,\"\")))))","v":4.4999999999999997E-3},{"$f":"H235*M235","v":26.999999999999996},33.749999999999993,37.79999999999999,{"$f":"O231","v":16.874999999999996},{"$f":"N235/M235","v":6000},{"$f":"O235/M235","v":7499.9999999999991},{"$f":"P235/M235","v":8399.9999999999982},{"$f":"IF(S231<J235,S231,J235)","v":3749.9999999999995},{"$f":"VLOOKUP(F235,AGE!F:J,4,FALSE)","v":2005},{"$f":"VLOOKUP(F235,AGE!F:J,5,FALSE)","v":1922},null,0,0]
[80,60,3,"80603","Duathlon des neiges","Distance S","Course à pied",4000,{"$f":"H236*1.1","v":4400},{"$f":"H236*0.9","v":3600},4.5,"Min/km",{"$f":"IF(L236=\"Sec/100m\",((K236)/60/100),(IF(L236=\"Km/h\",60/K236/1000,(IF(L236=\"Min/km\",K236/1000,\"\")))))","v":4.4999999999999997E-3},{"$f":"H236*M236","v":18},{"$f":"N236*1.25","v":22.5},25.2,{"$f":"O232","v":11.25},{"$f":"N236/M236","v":4000.0000000000005},{"$f":"O236/M236","v":5000},{"$f":"P236/M236","v":5600},2500,{"$f":"VLOOKUP(F236,AGE!F:J,4,FALSE)","v":2005},{"$f":"VLOOKUP(F236,AGE!F:J,5,FALSE)","v":1922},null,0,0]
[80,60,4,"80604","Duathlon des neiges","Distance S","Total",{"$f":"+SUM(H234:H236)","v":14000},{"$f":"SUM(I234:I236)","v":15400},{"$f":"SUM(J234:J236)","v":12600},null,null,"",{"$f":"SUM(N234:N236)","v":63},{"$f":"SUM(O234:O236)","v":78.75},null,{"$f":"SUM(Q234:Q236)","v":39.375},{"$f":"SUM(R234:R236)","v":14000},{"$f":"SUM(S234:S236)","v":17500},null,{"$f":"SUM(U234:U236)","v":8750},{"$f":"VLOOKUP(F237,AGE!F:J,4,FALSE)","v":2005},{"$f":"VLOOKUP(F237,AGE!F:J,5,FALSE)","v":1922},null,0,0]
[80,70,1,"80701","Duathlon des neiges","Distance M","Course à pied",8000,{"$f":"H238*1.1","v":8800},{"$f":"H238*0.9","v":7200},4.5,"Min/km",{"$f":"IF(L238=\"Sec/100m\",((K238)/60/100),(IF(L238=\"Km/h\",60/K238/1000,(IF(L238=\"Min/km\",K238/1000,\"\")))))","v":4.4999999999999997E-3},{"$f":"H238*M238","v":36},{"$f":"N238*1.25","v":45},{"$f":"N238*1.4","v":50.4},{"$f":"O234","v":22.5},{"$f":"N238/M238","v":8000.0000000000009},{"$f":"O238/M238","v":10000},{"$f":"P238/M238","v":11200},{"$f":"IF(S234<J238,S234,J238)","v":5000},{"$f":"VLOOKUP(F238,AGE!F:J,4,FALSE)","v":2003},{"$f":"VLOOKUP(F238,AGE!F:J,5,FALSE)","v":1922},null,0,0]
[80,70,2,"80702","Duathlon des neiges","Distance M","Ski de Fond",12000,13200.000000000002,10800,4.5,"Min/km",4.4999999999999997E-3,53.999999999999993,67.499999999999986,75.59999999999998,{"$f":"O235","v":33.749999999999993},12000,14999.999999999998,16799.999999999996,{"$f":"IF(S235<J239,S235,J239)","v":7499.9999999999991},{"$f":"VLOOKUP(F239,AGE!F:J,4,FALSE)","v":2003},{"$f":"VLOOKUP(F239,AGE!F:J,5,FALSE)","v":1922},null,0,0]
[80,70,3,"80703","Duathlon des neiges","Distance M","Course à pied",8000,{"$f":"H240*1.1","v":8800},{"$f":"H240*0.9","v":7200},4.5,"Min/km",{"$f":"IF(L240=\"Sec/100m\",((K240)/60/100),(IF(L240=\"Km/h\",60/K240/1000,(IF(L240=\"Min/km\",K240/1000,\"\")))))","v":4.4999999999999997E-3},{"$f":"H240*M240","v":36},{"$f":"N240*1.25","v":45},50.4,{"$f":"O236","v":22.5},{"$f":"N240/M240","v":8000.0000000000009},{"$f":"O240/M240","v":10000},{"$f":"P240/M240","v":11200},5000,{"$f":"VLOOKUP(F240,AGE!F:J,4,FALSE)","v":2003},{"$f":"VLOOKUP(F240,AGE!F:J,5,FALSE)","v":1922},null,0,0]
[80,70,4,"80704","Duathlon des neiges","Distance M","Total",{"$f":"+SUM(H238:H240)","v":28000},{"$f":"SUM(I238:I240)","v":30800},{"$f":"SUM(J238:J240)","v":25200},null,null,"",{"$f":"SUM(N238:N240)","v":126},{"$f":"SUM(O238:O240)","v":157.5},null,{"$f":"SUM(Q238:Q240)","v":78.75},{"$f":"SUM(R238:R240)","v":28000},{"$f":"SUM(S238:S240)","v":35000},null,{"$f":"SUM(U238:U240)","v":17500},{"$f":"VLOOKUP(F241,AGE!F:J,4,FALSE)","v":2003},{"$f":"VLOOKUP(F241,AGE!F:J,5,FALSE)","v":1922},null,0,0]
[92,10,1,"92101","Cyclathlon / Vétathlon","Jeune 6-9","Cyclisme",1000,{"$f":"H242*1.1","v":1100},{"$f":"H242*0.9","v":900},15,"Km/h",4.0000000000000001E-3,{"$f":"H242*M242","v":4},{"$f":"N242*1.25","v":5},{"$f":"N242*1.4","v":5.6},null,{"$f":"N242/M242","v":1000},{"$f":"O242/M242","v":1250},{"$f":"P242/M242","v":1399.9999999999998},{"$f":"+R242/2","v":500},{"$f":"VLOOKUP(F242,AGE!F:J,4,FALSE)","v":2015},{"$f":"VLOOKUP(F242,AGE!F:J,5,FALSE)","v":2012},null,0,0]
[92,10,2,"92102","Cyclathlon / Vétathlon","Jeune 6-9","Course à pied",500,550,450,5,"Min/km",5.0000000000000001E-3,{"$f":"H243*M243","v":2.5},{"$f":"N243*1.25","v":3.125},{"$f":"N243*1.4","v":3.5},null,{"$f":"N243/M243","v":500},{"$f":"O243/M243","v":625},{"$f":"P243/M243","v":700},{"$f":"+R243/2","v":250},{"$f":"VLOOKUP(F243,AGE!F:J,4,FALSE)","v":2015},{"$f":"VLOOKUP(F243,AGE!F:J,5,FALSE)","v":2012},null,0,0]
[92,10,3,"92103","Cyclathlon / Vétathlon","Jeune 6-9",null,null,null,null,null,null,null,null,null,null,null,null,null,null,null,{"$f":"VLOOKUP(F244,AGE!F:J,4,FALSE)","v":2015},{"$f":"VLOOKUP(F244,AGE!F:J,5,FALSE)","v":2012},null,0,0]
[92,10,4,"92104","Cyclathlon / Vétathlon","Jeune 6-9","Total",{"$f":"+SUM(H242:H244)","v":1500},{"$f":"SUM(I242:I244)","v":1650},{"$f":"SUM(J242:J244)","v":1350},null,null,{"$f":"IF(L245=\"Sec/100m\",((K245)/60/100),(IF(L245=\"Km/h\",60/K245/1000,(IF(L245=\"Min/km\",K245/1000,\"\")))))","v":""},{"$f":"SUM(N242:N244)","v":6.5},{"$f":"SUM(O242:O244)","v":8.125},null,{"$f":"SUM(Q242:Q244)","v":0},{"$f":"SUM(R242:R244)","v":1500},{"$f":"SUM(S242:S244)","v":1875},null,{"$f":"SUM(U242:U244)","v":750},{"$f":"VLOOKUP(F245,AGE!F:J,4,FALSE)","v":2015},{"$f":"VLOOKUP(F245,AGE!F:J,5,FALSE)","v":2012},null,0,0]
[92,20,1,"92201","Cyclathlon / Vétathlon","Jeune 8-11","Cyclisme",2000,{"$f":"H246*1.1","v":2200},{"$f":"H246*0.9","v":1800},15,"Km/h",{"$f":"IF(L246=\"Sec/100m\",((K246)/60/100),(IF(L246=\"Km/h\",60/K246/1000,(IF(L246=\"Min/km\",K246/1000,\"\")))))","v":4.0000000000000001E-3},{"$f":"H246*M246","v":8},{"$f":"N246*1.25","v":10},{"$f":"N246*1.4","v":11.2},null,{"$f":"N246/M246","v":2000},{"$f":"O246/M246","v":2500},{"$f":"P246/M246","v":2799.9999999999995},{"$f":"IF(S242<J246,S242,J246)","v":1250},{"$f":"VLOOKUP(F246,AGE!F:J,4,FALSE)","v":2013},{"$f":"VLOOKUP(F246,AGE!F:J,5,FALSE)","v":2010},null,0,0]
[92,20,2,"92202","Cyclathlon / Vétathlon","Jeune 8-11","Course à pied",1000,1100,900,5,"Min/km",5.0000000000000001E-3,{"$f":"H247*M247","v":5},{"$f":"N247*1.25","v":6.25},{"$f":"N247*1.4","v":7},null,{"$f":"N247/M247","v":1000},{"$f":"O247/M247","v":1250},{"$f":"P247/M247","v":1400},{"$f":"IF(S243<J247,S243,J247)","v":625},{"$f":"VLOOKUP(F247,AGE!F:J,4,FALSE)","v":2013},{"$f":"VLOOKUP(F247,AGE!F:J,5,FALSE)","v":2010},null,0,0]
[92,20,3,"92203","Cyclathlon / Vétathlon","Jeune 8-11",null,null,null,null,null,null,null,null,null,null,null,null,null,null,0,{"$f":"VLOOKUP(F248,AGE!F:J,4,FALSE)","v":2013},{"$f":"VLOOKUP(F248,AGE!F:J,5,FALSE)","v":2010},null,0,0]
[92,20,4,"92204","Cyclathlon / Vétathlon","Jeune 8-11","Total",{"$f":"+SUM(H246:H248)","v":3000},{"$f":"SUM(I246:I248)","v":3300},{"$f":"SUM(J246:J248)","v":2700},null,null,{"$f":"IF(L249=\"Sec/100m\",((K249)/60/100),(IF(L249=\"Km/h\",60/K249/1000,(IF(L249=\"Min/km\",K249/1000,\"\")))))","v":""},{"$f":"SUM(N246:N248)","v":13},{"$f":"SUM(O246:O248)","v":16.25},null,{"$f":"SUM(Q246:Q248)","v":0},{"$f":"SUM(R246:R248)","v":3000},{"$f":"SUM(S246:S248)","v":3750},null,{"$f":"SUM(U246:U248)","v":1875},{"$f":"VLOOKUP(F249,AGE!F:J,4,FALSE)","v":2013},{"$f":"VLOOKUP(F249,AGE!F:J,5,FALSE)","v":2010},null,0,0]
[92,30,1,"92301","Cyclathlon / Vétathlon","Jeune 10-13","Cyclisme",5000,{"$f":"H250*1.1","v":5500},{"$f":"H250*0.9","v":4500},15,"Km/h",{"$f":"IF(L250=\"Sec/100m\",((K250)/60/100),(IF(L250=\"Km/h\",60/K250/1000,(IF(L250=\"Min/km\",K250/1000,\"\")))))","v":4.0000000000000001E-3},{"$f":"H250*M250","v":20},{"$f":"N250*1.25","v":25},{"$f":"N250*1.4","v":28},null,{"$f":"N250/M250","v":5000},{"$f":"O250/M250","v":6250},{"$f":"P250/M250","v":7000},{"$f":"IF(S246<J250,S246,J250)","v":2500},{"$f":"VLOOKUP(F250,AGE!F:J,4,FALSE)","v":2011},{"$f":"VLOOKUP(F250,AGE!F:J,5,FALSE)","v":2008},null,0,0]
[92,30,2,"92302","Cyclathlon / Vétathlon","Jeune 10-13","Course à pied",1500,1650.0000000000002,1350,5,"Min/km",5.0000000000000001E-3,{"$f":"H251*M251","v":7.5},{"$f":"N251*1.25","v":9.375},{"$f":"N251*1.4","v":10.5},null,{"$f":"N251/M251","v":1500},{"$f":"O251/M251","v":1875},{"$f":"P251/M251","v":2100},{"$f":"IF(S247<J251,S247,J251)","v":1250},{"$f":"VLOOKUP(F251,AGE!F:J,4,FALSE)","v":2011},{"$f":"VLOOKUP(F251,AGE!F:J,5,FALSE)","v":2008},null,0,0]
[92,30,3,"92303","Cyclathlon / Vétathlon","Jeune 10-13",null,null,null,null,null,null,null,null,null,null,null,null,null,null,0,{"$f":"VLOOKUP(F252,AGE!F:J,4,FALSE)","v":2011},{"$f":"VLOOKUP(F252,AGE!F:J,5,FALSE)","v":2008},null,0,{"$f":"IF(U252>J252,\"Attention dist basse assimilée > distance officielle tolérance 10%\",)","v":0}]
[92,30,4,"92304","Cyclathlon / Vétathlon","Jeune 10-13","Total",{"$f":"+SUM(H250:H252)","v":6500},{"$f":"SUM(I250:I252)","v":7150},{"$f":"SUM(J250:J252)","v":5850},null,null,{"$f":"IF(L253=\"Sec/100m\",((K253)/60/100),(IF(L253=\"Km/h\",60/K253/1000,(IF(L253=\"Min/km\",K253/1000,\"\")))))","v":""},{"$f":"SUM(N250:N252)","v":27.5},{"$f":"SUM(O250:O252)","v":34.375},null,{"$f":"SUM(Q250:Q252)","v":0},{"$f":"SUM(R250:R252)","v":6500},{"$f":"SUM(S250:S252)","v":8125},null,{"$f":"SUM(U250:U252)","v":3750},{"$f":"VLOOKUP(F253,AGE!F:J,4,FALSE)","v":2011},{"$f":"VLOOKUP(F253,AGE!F:J,5,FALSE)","v":2008},null,0,0]
[92,40,1,"92401","Cyclathlon / Vétathlon","Jeune 12-19","Cyclisme",6000,{"$f":"H254*1.1","v":6600.0000000000009},{"$f":"H254*0.9","v":5400},15,"Km/h",{"$f":"IF(L254=\"Sec/100m\",((K254)/60/100),(IF(L254=\"Km/h\",60/K254/1000,(IF(L254=\"Min/km\",K254/1000,\"\")))))","v":4.0000000000000001E-3},{"$f":"H254*M254","v":24},{"$f":"N254*1.25","v":30},{"$f":"N254*1.4","v":33.599999999999994},null,{"$f":"N254/M254","v":6000},{"$f":"O254/M254","v":7500},{"$f":"P254/M254","v":8399.9999999999982},{"$f":"IF(S250<J254,S250,J254)","v":5400},{"$f":"VLOOKUP(F254,AGE!F:J,4,FALSE)","v":2009},{"$f":"VLOOKUP(F254,AGE!F:J,5,FALSE)","v":2002},null,0,0]
[92,40,2,"92402","Cyclathlon / Vétathlon","Jeune 12-19","Course à pied",2000,2200,1800,5,"Min/km",5.0000000000000001E-3,{"$f":"H255*M255","v":10},{"$f":"N255*1.25","v":12.5},{"$f":"N255*1.4","v":14},null,{"$f":"N255/M255","v":2000},{"$f":"O255/M255","v":2500},{"$f":"P255/M255","v":2800},{"$f":"IF(S251<J255,S251,J255)","v":1800},{"$f":"VLOOKUP(F255,AGE!F:J,4,FALSE)","v":2009},{"$f":"VLOOKUP(F255,AGE!F:J,5,FALSE)","v":2002},null,0,0]
[92,40,3,"92403","Cyclathlon / Vétathlon","Jeune 12-19",null,null,null,null,null,null,null,null,null,null,null,null,null,null,0,{"$f":"VLOOKUP(F256,AGE!F:J,4,FALSE)","v":2009},{"$f":"VLOOKUP(F256,AGE!F:J,5,FALSE)","v":2002},null,0,0]
[92,40,4,"92404","Cyclathlon / Vétathlon","Jeune 12-19","Total",{"$f":"+SUM(H254:H256)","v":8000},{"$f":"SUM(I254:I256)","v":8800},{"$f":"SUM(J254:J256)","v":7200},null,null,{"$f":"IF(L257=\"Sec/100m\",((K257)/60/100),(IF(L257=\"Km/h\",60/K257/1000,(IF(L257=\"Min/km\",K257/1000,\"\")))))","v":""},{"$f":"SUM(N254:N256)","v":34},{"$f":"SUM(O254:O256)","v":42.5},null,{"$f":"SUM(Q254:Q256)","v":0},{"$f":"SUM(R254:R256)","v":8000},{"$f":"SUM(S254:S256)","v":10000},null,{"$f":"SUM(U254:U256)","v":7200},{"$f":"VLOOKUP(F257,AGE!F:J,4,FALSE)","v":2009},{"$f":"VLOOKUP(F257,AGE!F:J,5,FALSE)","v":2002},null,0,0]
[92,41,1,"92411","Cyclathlon / Vétathlon","Distance XXS","Cyclisme",6000,{"$f":"H258*1.1","v":6600.0000000000009},{"$f":"H258*0.9","v":5400},15,"Km/h",4.0000000000000001E-3,{"$f":"H258*M258","v":24},{"$f":"N258*1.25","v":30},{"$f":"N258*1.4","v":33.599999999999994},null,{"$f":"N258/M258","v":6000},{"$f":"O258/M258","v":7500},{"$f":"P258/M258","v":8399.9999999999982},{"$f":"IF(S250<J258,S250,J258)","v":5400},{"$f":"VLOOKUP(F258,AGE!F:J,4,FALSE)","v":2009},{"$f":"VLOOKUP(F258,AGE!F:J,5,FALSE)","v":1922},null,{"$f":"IF(U258>R258,\"Attention dist basse assimilée > distance officielle\",)","v":0},{"$f":"IF(U258>J258,\"Attention dist basse assimilée > distance officielle tolérance 10%\",)","v":0}]
[92,41,2,"92412","Cyclathlon / Vétathlon","Distance XXS","Course à pied",2500,2750,2250,4.5,"Min/km",4.4999999999999997E-3,{"$f":"H259*M259","v":11.25},{"$f":"N259*1.25","v":14.0625},{"$f":"N259*1.4","v":15.749999999999998},null,{"$f":"N259/M259","v":2500},{"$f":"O259/M259","v":3125.0000000000005},{"$f":"P259/M259","v":3500},{"$f":"IF(S251<J259,S251,J259)","v":1875},{"$f":"VLOOKUP(F259,AGE!F:J,4,FALSE)","v":2009},{"$f":"VLOOKUP(F259,AGE!F:J,5,FALSE)","v":1922},null,0,0]
[92,41,3,"92413","Cyclathlon / Vétathlon","Distance XXS",null,null,null,null,null,null,null,null,null,null,null,null,null,null,{"$f":"IF(S252<J260,S252,J260)","v":0},{"$f":"VLOOKUP(F260,AGE!F:J,4,FALSE)","v":2009},{"$f":"VLOOKUP(F260,AGE!F:J,5,FALSE)","v":1922},null,0,0]
[92,41,4,"92414","Cyclathlon / Vétathlon","Distance XXS","Total",{"$f":"+SUM(H258:H260)","v":8500},{"$f":"SUM(I258:I260)","v":9350},{"$f":"SUM(J258:J260)","v":7650},null,null,{"$f":"IF(L261=\"Sec/100m\",((K261)/60/100),(IF(L261=\"Km/h\",60/K261/1000,(IF(L261=\"Min/km\",K261/1000,\"\")))))","v":""},{"$f":"SUM(N258:N260)","v":35.25},{"$f":"SUM(O258:O260)","v":44.0625},null,{"$f":"SUM(Q258:Q260)","v":0},{"$f":"SUM(R258:R260)","v":8500},{"$f":"SUM(S258:S260)","v":10625},null,{"$f":"SUM(U258:U260)","v":7275},{"$f":"VLOOKUP(F261,AGE!F:J,4,FALSE)","v":2009},{"$f":"VLOOKUP(F261,AGE!F:J,5,FALSE)","v":1922},null,0,0]
[92,50,1,"92501","Cyclathlon / Vétathlon","Distance XS","Cyclisme",10000,{"$f":"H262*1.1","v":11000},{"$f":"H262*0.9","v":9000},15,"Km/h",{"$f":"IF(L262=\"Sec/100m\",((K262)/60/100),(IF(L262=\"Km/h\",60/K262/1000,(IF(L262=\"Min/km\",K262/1000,\"\")))))","v":4.0000000000000001E-3},{"$f":"H262*M262","v":40},{"$f":"N262*1.25","v":50},{"$f":"N262*1.4","v":56},null,{"$f":"N262/M262","v":10000},{"$f":"O262/M262","v":12500},{"$f":"P262/M262","v":14000},{"$f":"IF(S254<J262,S254,J262)","v":7500},{"$f":"VLOOKUP(F262,AGE!F:J,4,FALSE)","v":2009},{"$f":"VLOOKUP(F262,AGE!F:J,5,FALSE)","v":1922},null,0,0]
[92,50,2,"92502","Cyclathlon / Vétathlon","Distance XS","Course à pied",4000,4400,3600,4.5,"Min/km",4.4999999999999997E-3,{"$f":"H263*M263","v":18},{"$f":"N263*1.25","v":22.5},{"$f":"N263*1.4","v":25.2},null,{"$f":"N263/M263","v":4000.0000000000005},{"$f":"O263/M263","v":5000},{"$f":"P263/M263","v":5600},{"$f":"IF(S255<J263,S255,J263)","v":2500},{"$f":"VLOOKUP(F263,AGE!F:J,4,FALSE)","v":2009},{"$f":"VLOOKUP(F263,AGE!F:J,5,FALSE)","v":1922},null,0,0]
[92,50,3,"92503","Cyclathlon / Vétathlon","Distance XS",null,null,null,null,null,null,null,null,null,null,null,null,null,null,{"$f":"IF(S256<J264,S256,J264)","v":0},{"$f":"VLOOKUP(F264,AGE!F:J,4,FALSE)","v":2009},{"$f":"VLOOKUP(F264,AGE!F:J,5,FALSE)","v":1922},null,0,0]
[92,50,4,"92504","Cyclathlon / Vétathlon","Distance XS","Total",{"$f":"+SUM(H262:H264)","v":14000},{"$f":"SUM(I262:I264)","v":15400},{"$f":"SUM(J262:J264)","v":12600},null,null,{"$f":"IF(L265=\"Sec/100m\",((K265)/60/100),(IF(L265=\"Km/h\",60/K265/1000,(IF(L265=\"Min/km\",K265/1000,\"\")))))","v":""},{"$f":"SUM(N262:N264)","v":58},{"$f":"SUM(O262:O264)","v":72.5},null,{"$f":"SUM(Q262:Q264)","v":0},{"$f":"SUM(R262:R264)","v":14000},{"$f":"SUM(S262:S264)","v":17500},null,{"$f":"SUM(U262:U264)","v":10000},{"$f":"VLOOKUP(F265,AGE!F:J,4,FALSE)","v":2009},{"$f":"VLOOKUP(F265,AGE!F:J,5,FALSE)","v":1922},null,0,0]
[92,60,1,"92601","Cyclathlon / Vétathlon","Distance S","Cyclisme",20000,{"$f":"H266*1.1","v":22000},{"$f":"H266*0.9","v":18000},15,"Km/h",{"$f":"IF(L266=\"Sec/100m\",((K266)/60/100),(IF(L266=\"Km/h\",60/K266/1000,(IF(L266=\"Min/km\",K266/1000,\"\")))))","v":4.0000000000000001E-3},{"$f":"H266*M266","v":80},{"$f":"N266*1.25","v":100},{"$f":"N266*1.4","v":112},null,{"$f":"N266/M266","v":20000},{"$f":"O266/M266","v":25000},{"$f":"P266/M266","v":28000},{"$f":"IF(S262<J266,S262,J266)","v":12500},{"$f":"VLOOKUP(F266,AGE!F:J,4,FALSE)","v":2005},{"$f":"VLOOKUP(F266,AGE!F:J,5,FALSE)","v":1922},null,0,0]
[92,60,2,"92602","Cyclathlon / Vétathlon","Distance S","Course à pied",7500,8250,6750,4.5,"Min/km",4.4999999999999997E-3,{"$f":"H267*M267","v":33.75},{"$f":"N267*1.25","v":42.1875},{"$f":"N267*1.4","v":47.25},null,{"$f":"N267/M267","v":7500.0000000000009},{"$f":"O267/M267","v":9375},{"$f":"P267/M267","v":10500},{"$f":"IF(S263<J267,S263,J267)","v":5000},{"$f":"VLOOKUP(F267,AGE!F:J,4,FALSE)","v":2005},{"$f":"VLOOKUP(F267,AGE!F:J,5,FALSE)","v":1922},null,0,0]
[92,60,3,"92603","Cyclathlon / Vétathlon","Distance S",null,null,null,null,null,null,null,null,null,null,null,null,null,null,0,{"$f":"VLOOKUP(F268,AGE!F:J,4,FALSE)","v":2005},{"$f":"VLOOKUP(F268,AGE!F:J,5,FALSE)","v":1922},null,0,0]
[92,60,4,"92604","Cyclathlon / Vétathlon","Distance S","Total",{"$f":"+SUM(H266:H268)","v":27500},{"$f":"SUM(I266:I268)","v":30250},{"$f":"SUM(J266:J268)","v":24750},null,null,{"$f":"IF(L269=\"Sec/100m\",((K269)/60/100),(IF(L269=\"Km/h\",60/K269/1000,(IF(L269=\"Min/km\",K269/1000,\"\")))))","v":""},{"$f":"SUM(N266:N268)","v":113.75},{"$f":"SUM(O266:O268)","v":142.1875},null,{"$f":"SUM(Q266:Q268)","v":0},{"$f":"SUM(R266:R268)","v":27500},{"$f":"SUM(S266:S268)","v":34375},null,{"$f":"SUM(U266:U268)","v":17500},{"$f":"VLOOKUP(F269,AGE!F:J,4,FALSE)","v":2005},{"$f":"VLOOKUP(F269,AGE!F:J,5,FALSE)","v":1922},null,0,0]
[92,70,1,"92701","Cyclathlon / Vétathlon","Distance M","Cyclisme",40000,{"$f":"H270*1.1","v":44000},{"$f":"H270*0.9","v":36000},15,"Km/h",{"$f":"IF(L270=\"Sec/100m\",((K270)/60/100),(IF(L270=\"Km/h\",60/K270/1000,(IF(L270=\"Min/km\",K270/1000,\"\")))))","v":4.0000000000000001E-3},{"$f":"H270*M270","v":160},{"$f":"N270*1.25","v":200},{"$f":"N270*1.4","v":224},null,{"$f":"N270/M270","v":40000},{"$f":"O270/M270","v":50000},{"$f":"P270/M270","v":56000},{"$f":"IF(S266<J270,S266,J270)","v":25000},{"$f":"VLOOKUP(F270,AGE!F:J,4,FALSE)","v":2003},{"$f":"VLOOKUP(F270,AGE!F:J,5,FALSE)","v":1922},null,0,0]
[92,70,2,"92702","Cyclathlon / Vétathlon","Distance M","Course à pied",15000,16500,13500,4.5,"Min/km",4.4999999999999997E-3,{"$f":"H271*M271","v":67.5},{"$f":"N271*1.25","v":84.375},{"$f":"N271*1.4","v":94.5},null,{"$f":"N271/M271","v":15000.000000000002},{"$f":"O271/M271","v":18750},{"$f":"P271/M271","v":21000},{"$f":"IF(S267<J271,S267,J271)","v":9375},{"$f":"VLOOKUP(F271,AGE!F:J,4,FALSE)","v":2003},{"$f":"VLOOKUP(F271,AGE!F:J,5,FALSE)","v":1922},null,0,0]
[92,70,3,"92703","Cyclathlon / Vétathlon","Distance M",null,null,null,null,null,null,null,null,null,null,null,null,null,null,0,{"$f":"VLOOKUP(F272,AGE!F:J,4,FALSE)","v":2003},{"$f":"VLOOKUP(F272,AGE!F:J,5,FALSE)","v":1922},null,0,0]
[92,70,4,"92704","Cyclathlon / Vétathlon","Distance M","Total",{"$f":"+SUM(H270:H272)","v":55000},{"$f":"SUM(I270:I272)","v":60500},{"$f":"SUM(J270:J272)","v":49500},null,null,{"$f":"IF(L273=\"Sec/100m\",((K273)/60/100),(IF(L273=\"Km/h\",60/K273/1000,(IF(L273=\"Min/km\",K273/1000,\"\")))))","v":""},{"$f":"SUM(N270:N272)","v":227.5},{"$f":"SUM(O270:O272)","v":284.375},null,{"$f":"SUM(Q270:Q272)","v":0},{"$f":"SUM(R270:R272)","v":55000},{"$f":"SUM(S270:S272)","v":68750},null,{"$f":"SUM(U270:U272)","v":34375},{"$f":"VLOOKUP(F273,AGE!F:J,4,FALSE)","v":2003},{"$f":"VLOOKUP(F273,AGE!F:J,5,FALSE)","v":1922},null,0,0]
[92,80,1,"92801","Cyclathlon / Vétathlon","Distance L","Cyclisme",80000,{"$f":"H274*1.1","v":88000},{"$f":"H274*0.9","v":72000},15,"Km/h",{"$f":"IF(L274=\"Sec/100m\",((K274)/60/100),(IF(L274=\"Km/h\",60/K274/1000,(IF(L274=\"Min/km\",K274/1000,\"\")))))","v":4.0000000000000001E-3},{"$f":"H274*M274","v":320},{"$f":"N274*1.25","v":400},{"$f":"N274*1.4","v":448},null,{"$f":"N274/M274","v":80000},{"$f":"O274/M274","v":100000},{"$f":"P274/M274","v":112000},{"$f":"IF(S270<J274,S270,J274)","v":50000},{"$f":"VLOOKUP(F274,AGE!F:J,4,FALSE)","v":2003},{"$f":"VLOOKUP(F274,AGE!F:J,5,FALSE)","v":1922},null,0,0]
[92,80,2,"92802","Cyclathlon / Vétathlon","Distance L","Course à pied",30000,33000,27000,4.5,"Min/km",4.4999999999999997E-3,{"$f":"H275*M275","v":135},{"$f":"N275*1.25","v":168.75},{"$f":"N275*1.4","v":189},null,{"$f":"N275/M275","v":30000.000000000004},{"$f":"O275/M275","v":37500},{"$f":"P275/M275","v":42000},{"$f":"IF(S271<J275,S271,J275)","v":18750},{"$f":"VLOOKUP(F275,AGE!F:J,4,FALSE)","v":2003},{"$f":"VLOOKUP(F275,AGE!F:J,5,FALSE)","v":1922},null,0,0]
[92,80,3,"92803","Cyclathlon / Vétathlon","Distance L",null,null,null,null,null,null,null,null,null,null,null,null,null,null,0,{"$f":"VLOOKUP(F276,AGE!F:J,4,FALSE)","v":2003},{"$f":"VLOOKUP(F276,AGE!F:J,5,FALSE)","v":1922},null,0,0]
[92,80,4,"92804","Cyclathlon / Vétathlon","Distance L","Total",{"$f":"+SUM(H274:H276)","v":110000},{"$f":"SUM(I274:I276)","v":121000},{"$f":"SUM(J274:J276)","v":99000},null,null,{"$f":"IF(L277=\"Sec/100m\",((K277)/60/100),(IF(L277=\"Km/h\",60/K277/1000,(IF(L277=\"Min/km\",K277/1000,\"\")))))","v":""},{"$f":"SUM(N274:N276)","v":455},{"$f":"SUM(O274:O276)","v":568.75},null,{"$f":"SUM(Q274:Q276)","v":0},{"$f":"SUM(R274:R276)","v":110000},{"$f":"SUM(S274:S276)","v":137500},null,{"$f":"SUM(U274:U276)","v":68750},{"$f":"VLOOKUP(F277,AGE!F:J,4,FALSE)","v":2003},{"$f":"VLOOKUP(F277,AGE!F:J,5,FALSE)","v":1922},null,0,0]
[92,90,1,"92901","Cyclathlon / Vétathlon","Distance XL","Cyclisme",120000,{"$f":"H278*1.1","v":132000},{"$f":"H278*0.9","v":108000},15,"Km/h",{"$f":"IF(L278=\"Sec/100m\",((K278)/60/100),(IF(L278=\"Km/h\",60/K278/1000,(IF(L278=\"Min/km\",K278/1000,\"\")))))","v":4.0000000000000001E-3},{"$f":"H278*M278","v":480},{"$f":"N278*1.25","v":600},{"$f":"N278*1.4","v":672},null,{"$f":"N278/M278","v":120000},{"$f":"O278/M278","v":150000},{"$f":"P278/M278","v":168000},{"$f":"(N278*0.75)/M278","v":90000},{"$f":"VLOOKUP(F278,AGE!F:J,4,FALSE)","v":2003},{"$f":"VLOOKUP(F278,AGE!F:J,5,FALSE)","v":1922},null,0,0]
[92,90,2,"92902","Cyclathlon / Vétathlon","Distance XL","Course à pied",40000,44000,36000,4.5,"Min/km",4.4999999999999997E-3,{"$f":"H279*M279","v":180},{"$f":"N279*1.25","v":225},{"$f":"N279*1.4","v":251.99999999999997},null,{"$f":"N279/M279","v":40000},{"$f":"O279/M279","v":50000.000000000007},{"$f":"P279/M279","v":56000},30000.000000000004,{"$f":"VLOOKUP(F279,AGE!F:J,4,FALSE)","v":2003},{"$f":"VLOOKUP(F279,AGE!F:J,5,FALSE)","v":1922},null,0,0]
[92,90,3,"92903","Cyclathlon / Vétathlon","Distance XL",null,null,null,null,null,null,null,null,null,null,null,null,null,null,null,{"$f":"VLOOKUP(F280,AGE!F:J,4,FALSE)","v":2003},{"$f":"VLOOKUP(F280,AGE!F:J,5,FALSE)","v":1922},null,0,0]
[92,90,4,"92904","Cyclathlon / Vétathlon","Distance XL","Total",{"$f":"+SUM(H278:H280)","v":160000},{"$f":"SUM(I278:I280)","v":176000},{"$f":"SUM(J278:J280)","v":144000},null,null,{"$f":"IF(L281=\"Sec/100m\",((K281)/60/100),(IF(L281=\"Km/h\",60/K281/1000,(IF(L281=\"Min/km\",K281/1000,\"\")))))","v":""},{"$f":"SUM(N278:N280)","v":660},{"$f":"SUM(O278:O280)","v":825},null,{"$f":"SUM(Q278:Q280)","v":0},{"$f":"SUM(R278:R280)","v":160000},{"$f":"SUM(S278:S280)","v":200000},null,{"$f":"SUM(U278:U280)","v":120000},{"$f":"VLOOKUP(F281,AGE!F:J,4,FALSE)","v":2003},{"$f":"VLOOKUP(F281,AGE!F:J,5,FALSE)","v":1922},null,0,0]
[93,10,1,"93101","Swim bike","Jeune 6-9","Natation",50,{"$f":"H282*1.1","v":55.000000000000007},{"$f":"H282*0.9","v":45},{"$f":"60+50","v":110},"Sec/100m",1.8333333333333333E-2,{"$f":"H282*M282","v":0.91666666666666663},{"$f":"N282*1.25","v":1.1458333333333333},{"$f":"N282*1.4","v":1.2833333333333332},null,{"$f":"N282/M282","v":50},{"$f":"O282/M282","v":62.499999999999993},{"$f":"P282/M282","v":70},{"$f":"+R282/2","v":25},{"$f":"VLOOKUP(F282,AGE!F:J,4,FALSE)","v":2015},{"$f":"VLOOKUP(F282,AGE!F:J,5,FALSE)","v":2012},null,0,0]
[93,10,2,"93102","Swim bike","Jeune 6-9","Cyclisme",1000,{"$f":"H283*1.1","v":1100},{"$f":"H283*0.9","v":900},15,"Km/h",4.0000000000000001E-3,{"$f":"H283*M283","v":4},{"$f":"N283*1.25","v":5},{"$f":"N283*1.4","v":5.6},null,{"$f":"N283/M283","v":1000},{"$f":"O283/M283","v":1250},{"$f":"P283/M283","v":1399.9999999999998},{"$f":"+R283/2","v":500},{"$f":"VLOOKUP(F283,AGE!F:J,4,FALSE)","v":2015},{"$f":"VLOOKUP(F283,AGE!F:J,5,FALSE)","v":2012},null,0,0]
[93,10,3,"93103","Swim bike","Jeune 6-9",null,null,null,null,null,null,null,null,null,null,null,null,null,null,null,{"$f":"VLOOKUP(F284,AGE!F:J,4,FALSE)","v":2015},{"$f":"VLOOKUP(F284,AGE!F:J,5,FALSE)","v":2012},null,0,0]
[93,10,4,"93104","Swim bike","Jeune 6-9","Total",{"$f":"+SUM(H282:H284)","v":1050},{"$f":"SUM(I282:I284)","v":1155},{"$f":"SUM(J282:J284)","v":945},null,null,{"$f":"IF(L285=\"Sec/100m\",((K285)/60/100),(IF(L285=\"Km/h\",60/K285/1000,(IF(L285=\"Min/km\",K285/1000,\"\")))))","v":""},{"$f":"SUM(N282:N284)","v":4.916666666666667},{"$f":"SUM(O282:O284)","v":6.145833333333333},null,{"$f":"SUM(Q282:Q284)","v":0},{"$f":"SUM(R282:R284)","v":1050},{"$f":"SUM(S282:S284)","v":1312.5},null,{"$f":"SUM(U282:U284)","v":525},{"$f":"VLOOKUP(F285,AGE!F:J,4,FALSE)","v":2015},{"$f":"VLOOKUP(F285,AGE!F:J,5,FALSE)","v":2012},null,0,0]
[93,20,1,"93201","Swim bike","Jeune 8-11","Natation",100,{"$f":"H286*1.1","v":110.00000000000001},{"$f":"H286*0.9","v":90},{"$f":"60+50","v":110},"Sec/100m",{"$f":"IF(L286=\"Sec/100m\",((K286)/60/100),(IF(L286=\"Km/h\",60/K286/1000,(IF(L286=\"Min/km\",K286/1000,\"\")))))","v":1.8333333333333333E-2},{"$f":"H286*M286","v":1.8333333333333333},{"$f":"N286*1.25","v":2.2916666666666665},{"$f":"N286*1.4","v":2.5666666666666664},{"$f":"O282","v":1.1458333333333333},{"$f":"N286/M286","v":100},{"$f":"O286/M286","v":124.99999999999999},{"$f":"P286/M286","v":140},{"$f":"IF(S282<J286,S282,J286)","v":62.499999999999993},{"$f":"VLOOKUP(F286,AGE!F:J,4,FALSE)","v":2013},{"$f":"VLOOKUP(F286,AGE!F:J,5,FALSE)","v":2010},null,0,0]
[93,20,2,"93202","Swim bike","Jeune 8-11","Cyclisme",2000,{"$f":"H287*1.1","v":2200},{"$f":"H287*0.9","v":1800},15,"Km/h",4.0000000000000001E-3,{"$f":"H287*M287","v":8},{"$f":"N287*1.25","v":10},{"$f":"N287*1.4","v":11.2},{"$f":"O283","v":5},{"$f":"N287/M287","v":2000},{"$f":"O287/M287","v":2500},{"$f":"P287/M287","v":2799.9999999999995},{"$f":"IF(S283<J287,S283,J287)","v":1250},{"$f":"VLOOKUP(F287,AGE!F:J,4,FALSE)","v":2013},{"$f":"VLOOKUP(F287,AGE!F:J,5,FALSE)","v":2010},null,0,0]
[93,20,3,"93203","Swim bike","Jeune 8-11",null,null,null,null,null,null,null,null,null,null,null,null,null,null,0,{"$f":"VLOOKUP(F288,AGE!F:J,4,FALSE)","v":2013},{"$f":"VLOOKUP(F288,AGE!F:J,5,FALSE)","v":2010},null,0,0]
[93,20,4,"93204","Swim bike","Jeune 8-11","Total",{"$f":"+SUM(H286:H288)","v":2100},{"$f":"SUM(I286:I288)","v":2310},{"$f":"SUM(J286:J288)","v":1890},null,null,{"$f":"IF(L289=\"Sec/100m\",((K289)/60/100),(IF(L289=\"Km/h\",60/K289/1000,(IF(L289=\"Min/km\",K289/1000,\"\")))))","v":""},{"$f":"SUM(N286:N288)","v":9.8333333333333339},{"$f":"SUM(O286:O288)","v":12.291666666666666},null,{"$f":"SUM(Q286:Q288)","v":6.145833333333333},{"$f":"SUM(R286:R288)","v":2100},{"$f":"SUM(S286:S288)","v":2625},null,{"$f":"SUM(U286:U288)","v":1312.5},{"$f":"VLOOKUP(F289,AGE!F:J,4,FALSE)","v":2013},{"$f":"VLOOKUP(F289,AGE!F:J,5,FALSE)","v":2010},null,0,0]
[93,30,1,"93301","Swim bike","Jeune 10-13","Natation",200,{"$f":"H290*1.1","v":220.00000000000003},{"$f":"H290*0.9","v":180},{"$f":"60+50","v":110},"Sec/100m",{"$f":"IF(L290=\"Sec/100m\",((K290)/60/100),(IF(L290=\"Km/h\",60/K290/1000,(IF(L290=\"Min/km\",K290/1000,\"\")))))","v":1.8333333333333333E-2},{"$f":"H290*M290","v":3.6666666666666665},{"$f":"N290*1.25","v":4.583333333333333},{"$f":"N290*1.4","v":5.1333333333333329},{"$f":"O286","v":2.2916666666666665},{"$f":"N290/M290","v":200},{"$f":"O290/M290","v":249.99999999999997},{"$f":"P290/M290","v":280},{"$f":"IF(S286<J290,S286,J290)","v":124.99999999999999},{"$f":"VLOOKUP(F290,AGE!F:J,4,FALSE)","v":2011},{"$f":"VLOOKUP(F290,AGE!F:J,5,FALSE)","v":2008},null,0,0]
[93,30,2,"93302","Swim bike","Jeune 10-13","Cyclisme",5000,{"$f":"H291*1.1","v":5500},{"$f":"H291*0.9","v":4500},15,"Km/h",4.0000000000000001E-3,{"$f":"H291*M291","v":20},{"$f":"N291*1.25","v":25},{"$f":"N291*1.4","v":28},{"$f":"O287","v":10},{"$f":"N291/M291","v":5000},{"$f":"O291/M291","v":6250},{"$f":"P291/M291","v":7000},{"$f":"IF(S287<J291,S287,J291)","v":2500},{"$f":"VLOOKUP(F291,AGE!F:J,4,FALSE)","v":2011},{"$f":"VLOOKUP(F291,AGE!F:J,5,FALSE)","v":2008},null,0,0]
[93,30,3,"93303","Swim bike","Jeune 10-13",null,null,null,null,null,null,null,null,null,null,null,null,null,null,0,{"$f":"VLOOKUP(F292,AGE!F:J,4,FALSE)","v":2011},{"$f":"VLOOKUP(F292,AGE!F:J,5,FALSE)","v":2008},null,0,0]
[93,30,4,"93304","Swim bike","Jeune 10-13","Total",{"$f":"+SUM(H290:H292)","v":5200},{"$f":"SUM(I290:I292)","v":5720},{"$f":"SUM(J290:J292)","v":4680},null,null,{"$f":"IF(L293=\"Sec/100m\",((K293)/60/100),(IF(L293=\"Km/h\",60/K293/1000,(IF(L293=\"Min/km\",K293/1000,\"\")))))","v":""},{"$f":"SUM(N290:N292)","v":23.666666666666668},{"$f":"SUM(O290:O292)","v":29.583333333333332},null,{"$f":"SUM(Q290:Q292)","v":12.291666666666666},{"$f":"SUM(R290:R292)","v":5200},{"$f":"SUM(S290:S292)","v":6500},null,{"$f":"SUM(U290:U292)","v":2625},{"$f":"VLOOKUP(F293,AGE!F:J,4,FALSE)","v":2011},{"$f":"VLOOKUP(F293,AGE!F:J,5,FALSE)","v":2008},null,0,0]
[93,40,1,"93401","Swim bike","Jeune 12-19","Natation",300,{"$f":"H294*1.1","v":330},{"$f":"H294*0.9","v":270},{"$f":"60+50","v":110},"Sec/100m",{"$f":"IF(L294=\"Sec/100m\",((K294)/60/100),(IF(L294=\"Km/h\",60/K294/1000,(IF(L294=\"Min/km\",K294/1000,\"\")))))","v":1.8333333333333333E-2},{"$f":"H294*M294","v":5.5},{"$f":"N294*1.25","v":6.875},{"$f":"N294*1.4","v":7.6999999999999993},{"$f":"O290","v":4.583333333333333},{"$f":"N294/M294","v":300},{"$f":"O294/M294","v":375},{"$f":"P294/M294","v":419.99999999999994},{"$f":"IF(S290<J294,S290,J294)","v":249.99999999999997},{"$f":"VLOOKUP(F294,AGE!F:J,4,FALSE)","v":2009},{"$f":"VLOOKUP(F294,AGE!F:J,5,FALSE)","v":2002},null,0,0]
[93,40,2,"93402","Swim bike","Jeune 12-19","Cyclisme",6000,{"$f":"H295*1.1","v":6600.0000000000009},{"$f":"H295*0.9","v":5400},15,"Km/h",4.0000000000000001E-3,{"$f":"H295*M295","v":24},{"$f":"N295*1.25","v":30},{"$f":"N295*1.4","v":33.599999999999994},{"$f":"O291","v":25},{"$f":"N295/M295","v":6000},{"$f":"O295/M295","v":7500},{"$f":"P295/M295","v":8399.9999999999982},{"$f":"IF(S291<J295,S291,J295)","v":5400},{"$f":"VLOOKUP(F295,AGE!F:J,4,FALSE)","v":2009},{"$f":"VLOOKUP(F295,AGE!F:J,5,FALSE)","v":2002},null,0,0]
[93,40,3,"93403","Swim bike","Jeune 12-19",null,null,null,null,null,null,null,null,null,null,null,null,null,null,0,{"$f":"VLOOKUP(F296,AGE!F:J,4,FALSE)","v":2009},{"$f":"VLOOKUP(F296,AGE!F:J,5,FALSE)","v":2002},null,0,0]
[93,40,4,"93404","Swim bike","Jeune 12-19","Total",{"$f":"+SUM(H294:H296)","v":6300},{"$f":"SUM(I294:I296)","v":6930.0000000000009},{"$f":"SUM(J294:J296)","v":5670},null,null,{"$f":"IF(L297=\"Sec/100m\",((K297)/60/100),(IF(L297=\"Km/h\",60/K297/1000,(IF(L297=\"Min/km\",K297/1000,\"\")))))","v":""},{"$f":"SUM(N294:N296)","v":29.5},{"$f":"SUM(O294:O296)","v":36.875},null,{"$f":"SUM(Q294:Q296)","v":29.583333333333332},{"$f":"SUM(R294:R296)","v":6300},{"$f":"SUM(S294:S296)","v":7875},null,{"$f":"SUM(U294:U296)","v":5650},{"$f":"VLOOKUP(F297,AGE!F:J,4,FALSE)","v":2009},{"$f":"VLOOKUP(F297,AGE!F:J,5,FALSE)","v":2002},null,0,0]
[93,41,1,"93411","Swim bike","Distance XXS","Natation",250,{"$f":"H298*1.1","v":275},{"$f":"H298*0.9","v":225},105,"Sec/100m",1.7500000000000002E-2,{"$f":"H298*M298","v":4.375},{"$f":"N298*1.25","v":5.46875},{"$f":"N298*1.4","v":6.125},{"$f":"O290","v":4.583333333333333},{"$f":"N298/M298","v":249.99999999999997},{"$f":"O298/M298","v":312.49999999999994},{"$f":"P298/M298","v":349.99999999999994},{"$f":"(N298*0.5)/M298","v":124.99999999999999},{"$f":"VLOOKUP(F298,AGE!F:J,4,FALSE)","v":2009},{"$f":"VLOOKUP(F298,AGE!F:J,5,FALSE)","v":1922},null,{"$f":"IF(U298>R298,\"Attention dist basse assimilée > distance officielle\",)","v":0},{"$f":"IF(U298>J298,\"Attention dist basse assimilée > distance officielle tolérance 10%\",)","v":0}]
[93,41,2,"93412","Swim bike","Distance XXS","Cyclisme",7500,{"$f":"H299*1.1","v":8250},{"$f":"H299*0.9","v":6750},15,"Km/h",4.0000000000000001E-3,{"$f":"H299*M299","v":30},{"$f":"N299*1.25","v":37.5},{"$f":"N299*1.4","v":42},{"$f":"O291","v":25},{"$f":"N299/M299","v":7500},{"$f":"O299/M299","v":9375},{"$f":"P299/M299","v":10500},{"$f":"(N299*0.5)/M299","v":3750},{"$f":"VLOOKUP(F299,AGE!F:J,4,FALSE)","v":2009},{"$f":"VLOOKUP(F299,AGE!F:J,5,FALSE)","v":1922},null,0,0]
[93,41,3,"93413","Swim bike","Distance XXS",null,null,null,null,null,null,null,null,null,null,null,null,null,null,null,{"$f":"VLOOKUP(F300,AGE!F:J,4,FALSE)","v":2009},{"$f":"VLOOKUP(F300,AGE!F:J,5,FALSE)","v":1922},null,0,0]
[93,41,4,"93414","Swim bike","Distance XXS","Total",{"$f":"+SUM(H298:H300)","v":7750},{"$f":"SUM(I298:I300)","v":8525},{"$f":"SUM(J298:J300)","v":6975},null,null,{"$f":"IF(L301=\"Sec/100m\",((K301)/60/100),(IF(L301=\"Km/h\",60/K301/1000,(IF(L301=\"Min/km\",K301/1000,\"\")))))","v":""},{"$f":"SUM(N298:N300)","v":34.375},{"$f":"SUM(O298:O300)","v":42.96875},null,{"$f":"SUM(Q298:Q300)","v":29.583333333333332},{"$f":"SUM(R298:R300)","v":7750},{"$f":"SUM(S298:S300)","v":9687.5},null,{"$f":"SUM(U298:U300)","v":3875},{"$f":"VLOOKUP(F301,AGE!F:J,4,FALSE)","v":2009},{"$f":"VLOOKUP(F301,AGE!F:J,5,FALSE)","v":1922},null,0,0]
[93,50,1,"93501","Swim bike","Distance XS","Natation",500,{"$f":"H302*1.1","v":550},{"$f":"H302*0.9","v":450},105,"Sec/100m",{"$f":"IF(L302=\"Sec/100m\",((K302)/60/100),(IF(L302=\"Km/h\",60/K302/1000,(IF(L302=\"Min/km\",K302/1000,\"\")))))","v":1.7500000000000002E-2},{"$f":"H302*M302","v":8.75},{"$f":"N302*1.25","v":10.9375},{"$f":"N302*1.4","v":12.25},{"$f":"O294","v":6.875},{"$f":"N302/M302","v":499.99999999999994},{"$f":"O302/M302","v":624.99999999999989},{"$f":"P302/M302","v":699.99999999999989},{"$f":"IF(S298<J302,S298,J302)","v":312.49999999999994},{"$f":"VLOOKUP(F302,AGE!F:J,4,FALSE)","v":2009},{"$f":"VLOOKUP(F302,AGE!F:J,5,FALSE)","v":1922},null,0,0]
[93,50,2,"93502","Swim bike","Distance XS","Cyclisme",10000,{"$f":"H303*1.1","v":11000},{"$f":"H303*0.9","v":9000},15,"Km/h",4.0000000000000001E-3,{"$f":"H303*M303","v":40},{"$f":"N303*1.25","v":50},{"$f":"N303*1.4","v":56},{"$f":"O295","v":30},{"$f":"N303/M303","v":10000},{"$f":"O303/M303","v":12500},{"$f":"P303/M303","v":14000},{"$f":"IF(S299<J303,S299,J303)","v":9000},{"$f":"VLOOKUP(F303,AGE!F:J,4,FALSE)","v":2009},{"$f":"VLOOKUP(F303,AGE!F:J,5,FALSE)","v":1922},null,0,0]
[93,50,3,"93503","Swim bike","Distance XS",null,null,null,null,null,null,null,null,null,null,null,null,null,null,0,{"$f":"VLOOKUP(F304,AGE!F:J,4,FALSE)","v":2009},{"$f":"VLOOKUP(F304,AGE!F:J,5,FALSE)","v":1922},null,0,0]
[93,50,4,{"$f":"CONCATENATE(A305,B305,C305)","v":"93504"},"Swim bike","Distance XS","Total",{"$f":"+SUM(H302:H304)","v":10500},{"$f":"SUM(I302:I304)","v":11550},{"$f":"SUM(J302:J304)","v":9450},null,null,{"$f":"IF(L305=\"Sec/100m\",((K305)/60/100),(IF(L305=\"Km/h\",60/K305/1000,(IF(L305=\"Min/km\",K305/1000,\"\")))))","v":""},{"$f":"SUM(N302:N304)","v":48.75},{"$f":"SUM(O302:O304)","v":60.9375},null,{"$f":"SUM(Q302:Q304)","v":36.875},{"$f":"SUM(R302:R304)","v":10500},{"$f":"SUM(S302:S304)","v":13125},null,{"$f":"SUM(U302:U304)","v":9312.5},{"$f":"VLOOKUP(F305,AGE!F:J,4,FALSE)","v":2009},{"$f":"VLOOKUP(F305,AGE!F:J,5,FALSE)","v":1922},null,0,0]
[93,60,1,"93601","Swim bike","Distance S","Natation",1000,{"$f":"H306*1.1","v":1100},{"$f":"H306*0.9","v":900},105,"Sec/100m",{"$f":"IF(L306=\"Sec/100m\",((K306)/60/100),(IF(L306=\"Km/h\",60/K306/1000,(IF(L306=\"Min/km\",K306/1000,\"\")))))","v":1.7500000000000002E-2},{"$f":"H306*M306","v":17.5},{"$f":"N306*1.25","v":21.875},{"$f":"N306*1.4","v":24.5},{"$f":"O302","v":10.9375},{"$f":"N306/M306","v":999.99999999999989},{"$f":"O306/M306","v":1249.9999999999998},{"$f":"P306/M306","v":1399.9999999999998},{"$f":"IF(S302<J306,S302,J306)","v":624.99999999999989},{"$f":"VLOOKUP(F306,AGE!F:J,4,FALSE)","v":2005},{"$f":"VLOOKUP(F306,AGE!F:J,5,FALSE)","v":1922},null,0,0]
[93,60,2,"93602","Swim bike","Distance S","Cyclisme",20000,{"$f":"H307*1.1","v":22000},{"$f":"H307*0.9","v":18000},15,"Km/h",4.0000000000000001E-3,{"$f":"H307*M307","v":80},{"$f":"N307*1.25","v":100},{"$f":"N307*1.4","v":112},{"$f":"O303","v":50},{"$f":"N307/M307","v":20000},{"$f":"O307/M307","v":25000},{"$f":"P307/M307","v":28000},{"$f":"IF(S303<J307,S303,J307)","v":12500},{"$f":"VLOOKUP(F307,AGE!F:J,4,FALSE)","v":2005},{"$f":"VLOOKUP(F307,AGE!F:J,5,FALSE)","v":1922},null,0,0]
[93,60,3,"93603","Swim bike","Distance S",null,null,null,null,null,null,null,null,null,null,null,null,null,null,0,{"$f":"VLOOKUP(F308,AGE!F:J,4,FALSE)","v":2005},{"$f":"VLOOKUP(F308,AGE!F:J,5,FALSE)","v":1922},null,0,0]
[93,60,4,"93604","Swim bike","Distance S","Total",{"$f":"+SUM(H306:H308)","v":21000},{"$f":"SUM(I306:I308)","v":23100},{"$f":"SUM(J306:J308)","v":18900},null,null,{"$f":"IF(L309=\"Sec/100m\",((K309)/60/100),(IF(L309=\"Km/h\",60/K309/1000,(IF(L309=\"Min/km\",K309/1000,\"\")))))","v":""},{"$f":"SUM(N306:N308)","v":97.5},{"$f":"SUM(O306:O308)","v":121.875},null,{"$f":"SUM(Q306:Q308)","v":60.9375},{"$f":"SUM(R306:R308)","v":21000},{"$f":"SUM(S306:S308)","v":26250},null,{"$f":"SUM(U306:U308)","v":13125},{"$f":"VLOOKUP(F309,AGE!F:J,4,FALSE)","v":2005},{"$f":"VLOOKUP(F309,AGE!F:J,5,FALSE)","v":1922},null,0,0]
[93,70,1,"93701","Swim bike","Distance M","Natation",2000,{"$f":"H310*1.1","v":2200},{"$f":"H310*0.9","v":1800},105,"Sec/100m",{"$f":"IF(L310=\"Sec/100m\",((K310)/60/100),(IF(L310=\"Km/h\",60/K310/1000,(IF(L310=\"Min/km\",K310/1000,\"\")))))","v":1.7500000000000002E-2},{"$f":"H310*M310","v":35},{"$f":"N310*1.25","v":43.75},{"$f":"N310*1.4","v":49},{"$f":"O306","v":21.875},{"$f":"N310/M310","v":1999.9999999999998},{"$f":"O310/M310","v":2499.9999999999995},{"$f":"P310/M310","v":2799.9999999999995},{"$f":"IF(S306<J310,S306,J310)","v":1249.9999999999998},{"$f":"VLOOKUP(F310,AGE!F:J,4,FALSE)","v":2003},{"$f":"VLOOKUP(F310,AGE!F:J,5,FALSE)","v":1922},null,0,0]
[93,70,2,"93702","Swim bike","Distance M","Cyclisme",40000,{"$f":"H311*1.1","v":44000},{"$f":"H311*0.9","v":36000},15,"Km/h",4.0000000000000001E-3,{"$f":"H311*M311","v":160},{"$f":"N311*1.25","v":200},{"$f":"N311*1.4","v":224},{"$f":"O307","v":100},{"$f":"N311/M311","v":40000},{"$f":"O311/M311","v":50000},{"$f":"P311/M311","v":56000},{"$f":"IF(S307<J311,S307,J311)","v":25000},{"$f":"VLOOKUP(F311,AGE!F:J,4,FALSE)","v":2003},{"$f":"VLOOKUP(F311,AGE!F:J,5,FALSE)","v":1922},null,0,0]
[93,70,3,"93703","Swim bike","Distance M",null,null,null,null,null,null,null,null,null,null,null,null,null,null,0,{"$f":"VLOOKUP(F312,AGE!F:J,4,FALSE)","v":2003},{"$f":"VLOOKUP(F312,AGE!F:J,5,FALSE)","v":1922},null,0,0]
[93,70,4,"93704","Swim bike","Distance M","Total",{"$f":"+SUM(H310:H312)","v":42000},{"$f":"SUM(I310:I312)","v":46200},{"$f":"SUM(J310:J312)","v":37800},null,null,{"$f":"IF(L313=\"Sec/100m\",((K313)/60/100),(IF(L313=\"Km/h\",60/K313/1000,(IF(L313=\"Min/km\",K313/1000,\"\")))))","v":""},{"$f":"SUM(N310:N312)","v":195},{"$f":"SUM(O310:O312)","v":243.75},null,{"$f":"SUM(Q310:Q312)","v":121.875},{"$f":"SUM(R310:R312)","v":42000},{"$f":"SUM(S310:S312)","v":52500},null,{"$f":"SUM(U310:U312)","v":26250},{"$f":"VLOOKUP(F313,AGE!F:J,4,FALSE)","v":2003},{"$f":"VLOOKUP(F313,AGE!F:J,5,FALSE)","v":1922},null,0,0]
[93,80,1,"93801","Swim bike","Distance L","Natation",3000,{"$f":"H314*1.1","v":3300.0000000000005},{"$f":"H314*0.9","v":2700},105,"Sec/100m",{"$f":"IF(L314=\"Sec/100m\",((K314)/60/100),(IF(L314=\"Km/h\",60/K314/1000,(IF(L314=\"Min/km\",K314/1000,\"\")))))","v":1.7500000000000002E-2},{"$f":"H314*M314","v":52.500000000000007},{"$f":"N314*1.25","v":65.625000000000014},null,{"$f":"O310","v":43.75},{"$f":"N314/M314","v":3000},{"$f":"O314/M314","v":3750.0000000000005},{"$f":"P314/M314","v":0},{"$f":"IF(S310<J314,S310,J314)","v":2499.9999999999995},{"$f":"VLOOKUP(F314,AGE!F:J,4,FALSE)","v":2003},{"$f":"VLOOKUP(F314,AGE!F:J,5,FALSE)","v":1922},null,0,0]
[93,80,2,"93802","Swim bike","Distance L","Cyclisme",80000,{"$f":"H315*1.1","v":88000},{"$f":"H315*0.9","v":72000},15,"Km/h",4.0000000000000001E-3,{"$f":"H315*M315","v":320},{"$f":"N315*1.25","v":400},null,{"$f":"O311","v":200},{"$f":"N315/M315","v":80000},{"$f":"O315/M315","v":100000},{"$f":"P315/M315","v":0},{"$f":"IF(S311<J315,S311,J315)","v":50000},{"$f":"VLOOKUP(F315,AGE!F:J,4,FALSE)","v":2003},{"$f":"VLOOKUP(F315,AGE!F:J,5,FALSE)","v":1922},null,0,0]
[93,80,3,"93803","Swim bike","Distance L",null,null,null,null,null,null,null,null,null,null,null,null,null,null,0,{"$f":"VLOOKUP(F316,AGE!F:J,4,FALSE)","v":2003},{"$f":"VLOOKUP(F316,AGE!F:J,5,FALSE)","v":1922},null,0,0]
[93,80,4,"93804","Swim bike","Distance L","Total",{"$f":"+SUM(H314:H316)","v":83000},{"$f":"SUM(I314:I316)","v":91300},{"$f":"SUM(J314:J316)","v":74700},null,null,{"$f":"IF(L317=\"Sec/100m\",((K317)/60/100),(IF(L317=\"Km/h\",60/K317/1000,(IF(L317=\"Min/km\",K317/1000,\"\")))))","v":""},{"$f":"SUM(N314:N316)","v":372.5},{"$f":"SUM(O314:O316)","v":465.625},null,{"$f":"SUM(Q314:Q316)","v":243.75},{"$f":"SUM(R314:R316)","v":83000},{"$f":"SUM(S314:S316)","v":103750},null,{"$f":"SUM(U314:U316)","v":52500},{"$f":"VLOOKUP(F317,AGE!F:J,4,FALSE)","v":2003},{"$f":"VLOOKUP(F317,AGE!F:J,5,FALSE)","v":1922},null,0,0]
[93,90,1,"93901","Swim bike","Distance XL","Natation",4000,{"$f":"H318*1.1","v":4400},{"$f":"H318*0.9","v":3600},105,"Sec/100m",{"$f":"IF(L318=\"Sec/100m\",((K318)/60/100),(IF(L318=\"Km/h\",60/K318/1000,(IF(L318=\"Min/km\",K318/1000,\"\")))))","v":1.7500000000000002E-2},{"$f":"H318*M318","v":70},{"$f":"N318*1.25","v":87.5},null,{"$f":"O314","v":65.625000000000014},{"$f":"N318/M318","v":3999.9999999999995},{"$f":"O318/M318","v":4999.9999999999991},{"$f":"P318/M318","v":0},{"$f":"(N318*0.75)/M318","v":2999.9999999999995},{"$f":"VLOOKUP(F318,AGE!F:J,4,FALSE)","v":2003},{"$f":"VLOOKUP(F318,AGE!F:J,5,FALSE)","v":1922},null,0,0]
[93,90,2,"93902","Swim bike","Distance XL","Cyclisme",120000,{"$f":"H319*1.1","v":132000},{"$f":"H319*0.9","v":108000},15,"Km/h",4.0000000000000001E-3,{"$f":"H319*M319","v":480},{"$f":"N319*1.25","v":600},null,{"$f":"O315","v":400},{"$f":"N319/M319","v":120000},{"$f":"O319/M319","v":150000},{"$f":"P319/M319","v":0},90000,{"$f":"VLOOKUP(F319,AGE!F:J,4,FALSE)","v":2003},{"$f":"VLOOKUP(F319,AGE!F:J,5,FALSE)","v":1922},null,0,0]
[93,90,3,"93903","Swim bike","Distance XL",null,null,null,null,null,null,null,null,null,null,null,null,null,null,{"$f":"S316","v":0},{"$f":"VLOOKUP(F320,AGE!F:J,4,FALSE)","v":2003},{"$f":"VLOOKUP(F320,AGE!F:J,5,FALSE)","v":1922},null,0,0]
[93,90,4,"93904","Swim bike","Distance XL","Total",{"$f":"+SUM(H318:H320)","v":124000},{"$f":"SUM(I318:I320)","v":136400},{"$f":"SUM(J318:J320)","v":111600},null,null,{"$f":"IF(L321=\"Sec/100m\",((K321)/60/100),(IF(L321=\"Km/h\",60/K321/1000,(IF(L321=\"Min/km\",K321/1000,\"\")))))","v":""},{"$f":"SUM(N318:N320)","v":550},{"$f":"SUM(O318:O320)","v":687.5},null,{"$f":"SUM(Q318:Q320)","v":465.625},{"$f":"SUM(R318:R320)","v":124000},{"$f":"SUM(S318:S320)","v":155000},null,{"$f":"SUM(U318:U320)","v":93000},{"$f":"VLOOKUP(F321,AGE!F:J,4,FALSE)","v":2003},{"$f":"VLOOKUP(F321,AGE!F:J,5,FALSE)","v":1922},null,0,0]
[90,10,1,"90101","Raid","Jeune 6-9","Raid",null,null,null,null,null,null,{"$f":"(O322+Q322)/2","v":90},120,null,{"$f":"+O322/2","v":60},null,null,null,null,{"$f":"VLOOKUP(F322,AGE!F:J,4,FALSE)","v":2015},{"$f":"VLOOKUP(F322,AGE!F:J,5,FALSE)","v":2012},null,0,0]
[90,20,1,"90201","Raid","Jeune 8-11","Raid",null,null,null,null,null,null,{"$f":"(O323+Q323)/2","v":150},180,null,120,null,null,null,null,{"$f":"VLOOKUP(F323,AGE!F:J,4,FALSE)","v":2013},{"$f":"VLOOKUP(F323,AGE!F:J,5,FALSE)","v":2010},null,0,0]
[90,30,1,"90301","Raid","Jeune 10-13","Raid",null,null,null,null,null,null,210,{"$f":"+O323+60","v":240},null,{"$f":"+O323","v":180},null,null,null,null,{"$f":"VLOOKUP(F324,AGE!F:J,4,FALSE)","v":2011},{"$f":"VLOOKUP(F324,AGE!F:J,5,FALSE)","v":2008},null,{"$f":"IF(U324>R324,\"Attention dist basse assimilée > distance officielle\",)","v":0},{"$f":"IF(U324>J324,\"Attention dist basse assimilée > distance officielle tolérance 10%\",)","v":0}]
[90,40,1,"90401","Raid","Jeune 12-19","Raid",null,null,null,null,null,null,270,{"$f":"+O324+60","v":300},null,{"$f":"+O324","v":240},null,null,null,null,{"$f":"VLOOKUP(F325,AGE!F:J,4,FALSE)","v":2009},{"$f":"VLOOKUP(F325,AGE!F:J,5,FALSE)","v":2002},null,0,0]
[90,41,1,"90411","Raid","Distance XXS","Raid",null,null,null,null,null,null,90,{"$f":"3*60","v":180},null,0,null,null,null,null,{"$f":"VLOOKUP(F326,AGE!F:J,4,FALSE)","v":2009},{"$f":"VLOOKUP(F326,AGE!F:J,5,FALSE)","v":1922},null,{"$f":"IF(U326>R326,\"Attention dist basse assimilée > distance officielle\",)","v":0},{"$f":"IF(U326>J326,\"Attention dist basse assimilée > distance officielle tolérance 10%\",)","v":0}]
[90,50,1,"90501","Raid","Distance XS","Raid",null,null,null,null,null,null,240,300,null,{"$f":"3*60","v":180},null,null,null,null,{"$f":"VLOOKUP(F327,AGE!F:J,4,FALSE)","v":2009},{"$f":"VLOOKUP(F327,AGE!F:J,5,FALSE)","v":1922},null,0,0]
[90,60,1,"90601","Raid","Distance S","Raid",null,null,null,null,null,null,360,{"$f":"Q329","v":420},null,{"$f":"5*60","v":300},null,null,null,null,{"$f":"VLOOKUP(F328,AGE!F:J,4,FALSE)","v":2005},{"$f":"VLOOKUP(F328,AGE!F:J,5,FALSE)","v":1922},null,0,0]
[90,70,1,"90701","Raid","Distance M","Raid",null,null,null,null,null,null,570,{"$f":"Q330","v":720},null,{"$f":"7*60","v":420},null,null,null,null,{"$f":"VLOOKUP(F329,AGE!F:J,4,FALSE)","v":2003},{"$f":"VLOOKUP(F329,AGE!F:J,5,FALSE)","v":1922},null,0,0]
[90,80,1,"90801","Raid","Distance L","Raid",null,null,null,null,null,null,1080,1440,null,{"$f":"12*60","v":720},null,null,null,null,{"$f":"VLOOKUP(F330,AGE!F:J,4,FALSE)","v":2003},{"$f":"VLOOKUP(F330,AGE!F:J,5,FALSE)","v":1922},null,0,0]
[90,90,1,"90901","Raid","Distance XL","Raid",null,null,null,null,null,null,1800,2160,null,{"$f":"24*60","v":1440},null,null,null,null,{"$f":"VLOOKUP(F331,AGE!F:J,4,FALSE)","v":2003},{"$f":"VLOOKUP(F331,AGE!F:J,5,FALSE)","v":1922},null,0,0]
[90,91,1,"90911","Raid","Distance XXL","Raid",null,null,null,null,null,null,null,null,null,{"$f":"36*60","v":2160},null,null,null,null,{"$f":"VLOOKUP(F332,AGE!F:J,4,FALSE)","v":2003},{"$f":"VLOOKUP(F332,AGE!F:J,5,FALSE)","v":1922},null,0,0]
[91,41,1,"91411","Swim Run","Distance XXS","Swim Run",{"$f":"(I333+J333)/2","v":1750},2500,1000,105,"Sec/100m",{"$f":"IF(L333=\"Sec/100m\",((K333)/60/100),(IF(L333=\"Km/h\",60/K333/1000,(IF(L333=\"Min/km\",K333/1000,\"\")))))","v":1.7500000000000002E-2},{"$f":"H333*M333","v":30.625000000000004},{"$f":"N333*1.25","v":38.281250000000007},null,{"$f":"O333/2","v":19.140625000000004},{"$f":"N333/M333","v":1750},null,null,null,{"$f":"VLOOKUP(F333,AGE!F:J,4,FALSE)","v":2009},{"$f":"VLOOKUP(F333,AGE!F:J,5,FALSE)","v":1922},null,{"$f":"IF(U333>R333,\"Attention dist basse assimilée > distance officielle\",)","v":0},{"$f":"IF(U333>J333,\"Attention dist basse assimilée > distance officielle tolérance 10%\",)","v":0}]
[91,41,4,"91414","Swim Run","Distance XXS","Swim Run",{"$f":"(I334+J334)/2","v":1750},2500,1000,105,"Sec/100m",1.7500000000000002E-2,30.625000000000004,38.281250000000007,null,{"$f":"O334/2","v":19.140625000000004},{"$f":"N334/M334","v":1750},null,null,null,{"$f":"VLOOKUP(F334,AGE!F:J,4,FALSE)","v":2009},{"$f":"VLOOKUP(F334,AGE!F:J,5,FALSE)","v":1922},null,0,0]
[91,50,1,"91501","Swim Run","Distance XS","Swim Run",{"$f":"(I335+J335)/2","v":3500},5000,2000,105,"Sec/100m",{"$f":"IF(L335=\"Sec/100m\",((K335)/60/100),(IF(L335=\"Km/h\",60/K335/1000,(IF(L335=\"Min/km\",K335/1000,\"\")))))","v":1.7500000000000002E-2},{"$f":"H335*M335","v":61.250000000000007},{"$f":"N335*1.25","v":76.562500000000014},null,{"$f":"O335/2","v":38.281250000000007},{"$f":"N335/M335","v":3500},null,null,null,{"$f":"VLOOKUP(F335,AGE!F:J,4,FALSE)","v":2009},{"$f":"VLOOKUP(F335,AGE!F:J,5,FALSE)","v":1922},null,0,0]
[91,50,4,{"$f":"CONCATENATE(A336,B336,C336)","v":"91504"},"Swim Run","Distance XS","Swim Run",{"$f":"(I336+J336)/2","v":3500},5000,2000,105,"Sec/100m",{"$f":"IF(L336=\"Sec/100m\",((K336)/60/100),(IF(L336=\"Km/h\",60/K336/1000,(IF(L336=\"Min/km\",K336/1000,\"\")))))","v":1.7500000000000002E-2},{"$f":"H336*M336","v":61.250000000000007},{"$f":"N336*1.25","v":76.562500000000014},null,{"$f":"O336/2","v":38.281250000000007},{"$f":"N336/M336","v":3500},null,null,null,{"$f":"VLOOKUP(F336,AGE!F:J,4,FALSE)","v":2009},{"$f":"VLOOKUP(F336,AGE!F:J,5,FALSE)","v":1922},null,0,0]
[91,60,1,"91601","Swim Run","Distance S","Swim Run",{"$f":"(I337+J337)/2","v":8750},12500,5000,105,"Sec/100m",1.7500000000000002E-2,153.12500000000003,191.40625000000003,null,{"$f":"O335+1","v":77.562500000000014},8750,null,null,null,{"$f":"VLOOKUP(F337,AGE!F:J,4,FALSE)","v":2005},{"$f":"VLOOKUP(F337,AGE!F:J,5,FALSE)","v":1922},null,0,0]
[91,60,4,{"$f":"CONCATENATE(A338,B338,C338)","v":"91604"},"Swim Run","Distance S","Swim Run",{"$f":"(I338+J338)/2","v":8750},12500,5000,105,"Sec/100m",{"$f":"IF(L338=\"Sec/100m\",((K338)/60/100),(IF(L338=\"Km/h\",60/K338/1000,(IF(L338=\"Min/km\",K338/1000,\"\")))))","v":1.7500000000000002E-2},{"$f":"H338*M338","v":153.12500000000003},{"$f":"N338*1.25","v":191.40625000000003},null,{"$f":"O336+1","v":77.562500000000014},{"$f":"N338/M338","v":8750},null,null,null,{"$f":"VLOOKUP(F338,AGE!F:J,4,FALSE)","v":2005},{"$f":"VLOOKUP(F338,AGE!F:J,5,FALSE)","v":1922},null,0,0]
[91,70,1,"91701","Swim Run","Distance M","Swim Run",16250,20000,12500,105,"Sec/100m",1.7500000000000002E-2,284.375,355.46875,null,192.40625000000003,16249.999999999998,null,null,null,{"$f":"VLOOKUP(F339,AGE!F:J,4,FALSE)","v":2003},{"$f":"VLOOKUP(F339,AGE!F:J,5,FALSE)","v":1922},null,0,0]
[91,70,4,{"$f":"CONCATENATE(A340,B340,C340)","v":"91704"},"Swim Run","Distance M","Swim Run",{"$f":"(I340+J340)/2","v":16250},20000,12500,105,"Sec/100m",{"$f":"IF(L340=\"Sec/100m\",((K340)/60/100),(IF(L340=\"Km/h\",60/K340/1000,(IF(L340=\"Min/km\",K340/1000,\"\")))))","v":1.7500000000000002E-2},{"$f":"H340*M340","v":284.375},{"$f":"N340*1.25","v":355.46875},null,192.40625000000003,{"$f":"N340/M340","v":16249.999999999998},null,null,null,{"$f":"VLOOKUP(F340,AGE!F:J,4,FALSE)","v":2003},{"$f":"VLOOKUP(F340,AGE!F:J,5,FALSE)","v":1922},null,0,0]
[91,80,1,"91801","Swim Run","Distance L","Swim Run",27500,35000,20000,105,"Sec/100m",1.7500000000000002E-2,481.25000000000006,601.56250000000011,null,356.46875,27500,null,null,null,{"$f":"VLOOKUP(F341,AGE!F:J,4,FALSE)","v":2003},{"$f":"VLOOKUP(F341,AGE!F:J,5,FALSE)","v":1922},null,0,0]
[91,80,4,{"$f":"CONCATENATE(A342,B342,C342)","v":"91804"},"Swim Run","Distance L","Swim Run",{"$f":"(I342+J342)/2","v":27500},35000,20000,105,"Sec/100m",{"$f":"IF(L342=\"Sec/100m\",((K342)/60/100),(IF(L342=\"Km/h\",60/K342/1000,(IF(L342=\"Min/km\",K342/1000,\"\")))))","v":1.7500000000000002E-2},{"$f":"H342*M342","v":481.25000000000006},{"$f":"N342*1.25","v":601.56250000000011},null,356.46875,{"$f":"N342/M342","v":27500},null,null,null,{"$f":"VLOOKUP(F342,AGE!F:J,4,FALSE)","v":2003},{"$f":"VLOOKUP(F342,AGE!F:J,5,FALSE)","v":1922},null,0,0]
[91,90,1,"91901","Swim Run","Distance XL","Swim Run",45000,55000,35000,105,"Sec/100m",1.7500000000000002E-2,787.50000000000011,984.37500000000011,null,602.56250000000011,45000,null,null,null,{"$f":"VLOOKUP(F343,AGE!F:J,4,FALSE)","v":2003},{"$f":"VLOOKUP(F343,AGE!F:J,5,FALSE)","v":1922},null,0,0]
[91,90,4,{"$f":"CONCATENATE(A344,B344,C344)","v":"91904"},"Swim Run","Distance XL","Swim Run",{"$f":"(I344+J344)/2","v":45000},55000,35000,105,"Sec/100m",{"$f":"IF(L344=\"Sec/100m\",((K344)/60/100),(IF(L344=\"Km/h\",60/K344/1000,(IF(L344=\"Min/km\",K344/1000,\"\")))))","v":1.7500000000000002E-2},{"$f":"H344*M344","v":787.50000000000011},{"$f":"N344*1.25","v":984.37500000000011},null,602.56250000000011,{"$f":"N344/M344","v":45000},null,null,null,{"$f":"VLOOKUP(F344,AGE!F:J,4,FALSE)","v":2003},{"$f":"VLOOKUP(F344,AGE!F:J,5,FALSE)","v":1922},null,0,0]
[91,91,1,"91911","Swim Run","Distance XXL","Swim Run",68750,55000,{"$f":"+I345*1.5","v":82500},105,"Sec/100m",1.7500000000000002E-2,1203.1250000000002,1503.9062500000002,null,985.37500000000011,68750,null,null,null,{"$f":"VLOOKUP(F345,AGE!F:J,4,FALSE)","v":2003},{"$f":"VLOOKUP(F345,AGE!F:J,5,FALSE)","v":1922},null,0,0]
[91,91,4,{"$f":"CONCATENATE(A346,B346,C346)","v":"91914"},"Swim Run","Distance XXL","Swim Run",{"$f":"(I346+J346)/2","v":68750},55000,{"$f":"+I346*1.5","v":82500},105,"Sec/100m",{"$f":"IF(L346=\"Sec/100m\",((K346)/60/100),(IF(L346=\"Km/h\",60/K346/1000,(IF(L346=\"Min/km\",K346/1000,\"\")))))","v":1.7500000000000002E-2},{"$f":"H346*M346","v":1203.1250000000002},{"$f":"N346*1.25","v":1503.9062500000002},null,985.37500000000011,{"$f":"N346/M346","v":68750},null,null,null,{"$f":"VLOOKUP(F346,AGE!F:J,4,FALSE)","v":2003},{"$f":"VLOOKUP(F346,AGE!F:J,5,FALSE)","v":1922},null,0,0]

{"sheet":"AGE","index":1,"n_rows":12,"n_cols":10,"rows_kept":12,"cut":false,"hidden":true,"merged":[]}
[null,"MOIS A PARTIR DUQUEL ON AFFICHE LES CATEGORIES D'AGE DE LA SAISON SUIVANTE :",null,"ANNEE AFFICHEE",null,"Course","Age atteint au cours de la saison mini","Age atteint au cours de la saison maxi","ANNEE mini","ANNEE maxi"]
[null,9,null,{"$f":"IF(MONTH(TODAY())>=B2,YEAR(TODAY())+1,YEAR(TODAY()))","v":2021},null,"Jeune 6-9",6,9,{"$f":"$D$2-G2","v":2015},{"$f":"$D$2-H2","v":2012}]
[null,null,null,null,null,"Jeune 8-11",8,11,{"$f":"$D$2-G3","v":2013},2010]
[null,null,null,null,null,"Jeune 10-13",10,13,2011,2008]
[null,null,null,null,null,"Jeune 12-19",12,19,2009,2002]
[null,null,null,null,null,"Distance XXS",12,99,2009,1922]
[null,null,null,null,null,"Distance XS",12,99,2009,1922]
[null,null,null,null,null,"Distance S",16,99,2005,1922]
[null,null,null,null,null,"Distance M",18,99,2003,1922]
[null,null,null,null,null,"Distance L",18,99,2003,1922]
[null,null,null,null,null,"Distance XL",18,99,2003,1922]
[null,null,null,null,null,"Distance XXL",18,99,2003,1922]

{"sheet":"Visualisation","index":2,"n_rows":23,"n_cols":20,"rows_kept":23,"cut":false,"hidden":false,"merged":[[0,2,0,3],[3,13,3,15],[3,10,3,12],[18,9,18,11],[3,2,3,9],[18,2,18,3],[10,11,10,12],[10,13,10,14],[11,11,11,12],[12,11,12,12],[13,11,13,12],[14,11,14,12],[11,13,11,14],[12,13,12,14],[13,13,13,14],[14,13,14,14]]}
["V 6",null,"Saisie case en Jaune",null,null,null,null,null,null,4,5,6,7,11,12,13,14,16,17,18]
[]
[]
[null,null,"Triathlon, Duathlon, Aquathlon, Swimrun \nDistances possibles ",null,null,null,null,null,null,null,"Epreuve Officielle",null,null,{"$f":"IF(OR(C12=\"Raid\",C12=\"Bike_and_Run\",C12=\"Swim_Run\"),\"\",\"Epreuve Assimilée\")","v":"Epreuve Assimilée"}]
[null,null,"Sélectionner la Compétition","Sélectionner le type d'épreuve",null,null,null,null,null,"Discipline","Distance Officielle","Tolérance Max +10%","Tolérance Min  -10%","Limite Haute 25%\n(distance)","Limite Haute 40% jeunes\n(Distance)","Limite Basse\n(distance)"]
[null,null,null,null,{"$f":"VLOOKUP(C6,'Liste déroulante'!$B$5:$C$16,2,FALSE)","v":{"$error":"#N/A"}},{"$f":"VLOOKUP(D6,'Liste déroulante'!E5:F15,2,FALSE)","v":{"$error":"#N/A"}},1,{"$f":"CONCATENATE(E6,F6,G6)","v":{"$error":"#N/A"}},{"$f":"IF(COUNTIF(Données!D:D,Visualisation!H6)>0, \"vrai\",\"faux\")","v":"faux"},{"$f":"IF($I6=\"FAUX\",\"\",VLOOKUP($H6,Données!$D$5:$U$346,$J$1,FALSE))","v":""},{"$f":"IF($I6=\"FAUX\",\"\",VLOOKUP($H6,Données!$D$5:$U$346,K1,FALSE))","v":""},{"$f":"IF($I6=\"FAUX\",\"\",VLOOKUP($H6,Données!$D$5:$U$346,L1,FALSE))","v":""},{"$f":"IF($I6=\"FAUX\",\"\",VLOOKUP($H6,Données!$D$5:$U$346,M1,FALSE))","v":""},{"$f":"IF($I6=\"FAUX\",\"\",VLOOKUP($H6,Données!$D$5:$U$346,R1,FALSE))","v":""},{"$f":"IF($I6=\"FAUX\",\"\",VLOOKUP($H6,Données!$D$5:$U$346,S1,FALSE))","v":""},{"$f":"IF($I6=\"FAUX\",\"\",VLOOKUP($H6,Données!$D$5:$U$346,T1,FALSE))","v":""}]
[null,null,null,null,null,null,2,{"$f":"CONCATENATE(E6,F6,G7)","v":{"$error":"#N/A"}},{"$f":"IF(COUNTIF(Données!D:D,Visualisation!H7)>0, \"vrai\",\"faux\")","v":"faux"},{"$f":"IF($I7=\"FAUX\",\"\",VLOOKUP($H7,Données!$D$5:$U$346,J1,FALSE))","v":""},{"$f":"IF($I7=\"FAUX\",\"\",VLOOKUP($H7,Données!$D$5:$U$346,K1,FALSE))","v":""},{"$f":"IF($I7=\"FAUX\",\"\",VLOOKUP($H7,Données!$D$5:$U$346,L1,FALSE))","v":""},{"$f":"IF($I7=\"FAUX\",\"\",VLOOKUP($H7,Données!$D$5:$U$346,M1,FALSE))","v":""},{"$f":"IF($I7=\"FAUX\",\"\",VLOOKUP($H7,Données!$D$5:$U$346,R1,FALSE))","v":""},{"$f":"IF($I7=\"FAUX\",\"\",VLOOKUP($H7,Données!$D$5:$U$346,S1,FALSE))","v":""},{"$f":"IF($I7=\"FAUX\",\"\",VLOOKUP($H7,Données!$D$5:$U$346,T1,FALSE))","v":""}]
[null,null,null,null,null,null,{"$f":"IF(OR(C6=\"Aquathlon\",C6=\"Cyclathlon_Vetathlon\",C6=\"Swim_Bike\"),\"\",3)","v":3},{"$f":"CONCATENATE(E6,F6,G8)","v":{"$error":"#N/A"}},{"$f":"IF(COUNTIF(Données!D:D,Visualisation!H8)>0, \"vrai\",\"faux\")","v":"faux"},{"$f":"IF($I8=\"FAUX\",\"\",VLOOKUP($H8,Données!$D$5:$U$346,J1,FALSE))","v":""},{"$f":"IF($I8=\"FAUX\",\"\",VLOOKUP($H8,Données!$D$5:$U$346,K1,FALSE))","v":""},{"$f":"IF($I8=\"FAUX\",\"\",VLOOKUP($H8,Données!$D$5:$U$346,L1,FALSE))","v":""},{"$f":"IF($I8=\"FAUX\",\"\",VLOOKUP($H8,Données!$D$5:$U$346,M1,FALSE))","v":""},{"$f":"IF($I8=\"FAUX\",\"\",VLOOKUP($H8,Données!$D$5:$U$346,R1,FALSE))","v":""},{"$f":"IF($I8=\"FAUX\",\"\",VLOOKUP($H8,Données!$D$5:$U$346,S1,FALSE))","v":""},{"$f":"IF($I8=\"FAUX\",\"\",VLOOKUP($H8,Données!$D$5:$U$346,T1,FALSE))","v":""}]
[null,null,null,null,null,null,4,{"$f":"CONCATENATE(E6,F6,G9)","v":{"$error":"#N/A"}},{"$f":"IF(COUNTIF(Données!D:D,Visualisation!H9)>0, \"vrai\",\"faux\")","v":"faux"},{"$f":"IF($I9=\"FAUX\",\"\",VLOOKUP($H9,Données!$D$5:$U$346,J1,FALSE))","v":""},{"$f":"IF($I9=\"FAUX\",\"\",VLOOKUP($H9,Données!$D$5:$U$346,K1,FALSE))","v":""},{"$f":"IF($I9=\"FAUX\",\"\",VLOOKUP($H9,Données!$D$5:$U$346,L1,FALSE))","v":""},{"$f":"IF($I9=\"FAUX\",\"\",VLOOKUP($H9,Données!$D$5:$U$346,M1,FALSE))","v":""},{"$f":"IF($I9=\"FAUX\",\"\",VLOOKUP($H9,Données!$D$5:$U$346,R1,FALSE))","v":""},{"$f":"IF($I9=\"FAUX\",\"\",VLOOKUP($H9,Données!$D$5:$U$346,S1,FALSE))","v":""},{"$f":"IF($I9=\"FAUX\",\"\",VLOOKUP($H9,Données!$D$5:$U$346,T1,FALSE))","v":""}]
[]
[null,null,"Contrôlez vos distances",null,null,null,null,null,null,"Discipline","Saisir les distances\n en mètre","Epreuve Officielle",null,{"$f":"IF(OR(C12=\"Raid\",C12=\"Bike and Run\",C12=\"Swim Run\"),\"\",\"Epreuve Assimilée\")","v":"Epreuve Assimilée"},null,null,{"$f":"CONCATENATE(\"Année de naissance saison \",AGE!D2)","v":"Année de naissance saison 2021"}]
[null,null,{"$f":"+C6","v":0},{"$f":"+D6","v":0},null,null,null,null,null,{"$f":"+J6","v":""},null,{"$f":"IF($K12=0,\"\",IF(AND($K12>=M6,$K12<=L6),\"Approuvé\",\"Refusé\"))","v":""},null,{"$f":"IF(K12=0,\"\",IF(O6=0,\"\",(IF(OR(K12>O6,K12<P6),\"Refusé\",\"Approuvé\"))))","v":""},null,null,"Mini"]
[null,null,null,null,null,null,null,null,null,{"$f":"+J7","v":""},null,{"$f":"IF($K13=0,\"\",IF(L7=\"\",\"\",IF(AND($K13>=M7,$K13<=L7),\"Approuvé\",\"Refusé\")))","v":""},null,{"$f":"IF(K13=0,\"\",IF(O7=\"\",\"\",IF(O7=0,\"\",(IF(OR(K13>O7,K13<P7),\"Refusé\",\"Approuvé\")))))","v":""},null,null,{"$f":"IF($I9=\"FAUX\",\"\",VLOOKUP($H9,Données!$D$5:$W$346,19,FALSE))","v":""}]
[null,null,null,null,null,null,null,null,null,{"$f":"+J8","v":""},null,{"$f":"IF($K14=0,\"\",IF(L8=\"\",\"\",IF(AND($K14>=M8,$K14<=L8),\"Approuvé\",\"Refusé\")))","v":""},null,{"$f":"IF(K14=0,\"\",IF(O8=\"\",\"\",IF(O8=0,\"\",(IF(OR(K14>O8,K14<P8),\"Refusé\",\"Approuvé\")))))","v":""},null,null,"Maxi"]
[null,null,null,null,null,null,null,null,null,null,{"$f":"IF(J14=\"\",SUM(K12:K13),SUM(K12:K14))","v":0},{"$f":"IF(L12=\"Refusé\",\"Refusé\",IF(L13=\"Refusé\",\"Refusé\",IF(L14=\"Refusé\",\"Refusé\",IF($K$15=0,\"\",IF(AND(K15>=M9,K15<=L9),\"Approuvé\",\"Refusé\")))))","v":""},null,{"$f":"IF(N12=\"Refusé\",\"Refusé\",IF(N13=\"Refusé\",\"Refusé\",IF(N14=\"Refusé\",\"Refusé\",IF($K$15=0,\"\",IF(AND(K15>=P9,K15<=N9),\"Approuvé\",IF(P9=\"\",\"\",\"Refusé\"))))))","v":""},null,null,{"$f":"IF($I9=\"FAUX\",\"\",VLOOKUP($H9,Données!$D$5:$W$346,20,FALSE))","v":""}]
[]
[]
[]
[null,null,"Bike&Run & Raid \nTemps estimé ",null,null,null,null,null,null,"Epreuve Officielle",null,null,null,{"$f":"CONCATENATE(\"Année de naissance saison \",AGE!D2)","v":"Année de naissance saison 2021"}]
[null,null,"Sélectionner la Compétition","Sélectionner le type d'épreuve",null,null,null,null,null,"Temps Moyen","Temps Max","Temps Min",null,"Mini"]
[null,null,null,null,{"$f":"VLOOKUP(C21,'Liste déroulante'!$B$5:$C$16,2,FALSE)","v":{"$error":"#N/A"}},{"$f":"VLOOKUP(D21,'Liste déroulante'!E5:F15,2,FALSE)","v":{"$error":"#N/A"}},1,{"$f":"CONCATENATE(E21,F21,G21)","v":{"$error":"#N/A"}},{"$f":"IF(COUNTIF(Données!D:D,Visualisation!H21)>0, \"vrai\",\"faux\")","v":"faux"},{"$f":"IF($I21=\"FAUX\",\"\",VLOOKUP($H21,Données!$D$5:$U$346,N1,FALSE))","v":""},{"$f":"IF($I21=\"FAUX\",\"\",VLOOKUP($H21,Données!$D$5:$U$346,O1,FALSE))","v":""},{"$f":"IF($I21=\"FAUX\",\"\",VLOOKUP($H21,Données!$D$5:$U$346,Q1,FALSE))","v":""},null,{"$f":"IF($I21=\"FAUX\",\"\",VLOOKUP($H21,Données!$D$5:$W$345,19))","v":""}]
[null,null,null,null,null,null,null,null,null,{"$f":"IF(J21=\"\",\"\",J21/60/24)","v":""},{"$f":"IF(J21=\"\",\"\",K21/60/24)","v":""},{"$f":"IF(J21=\"\",\"\",L21/60/24)","v":""},null,"Maxi"]
[null,null,null,null,null,null,null,null,null,null,null,null,null,{"$f":"IF($I21=\"FAUX\",\"\",VLOOKUP($H21,Données!$D$5:$W$345,20))","v":""}]

{"sheet":"Liste déroulante","index":3,"n_rows":16,"n_cols":25,"rows_kept":16,"cut":false,"hidden":true,"merged":[]}
[null,"Distance officielle",null,null,null,null,null,null,null,null,null,null,null,null,null,null,null,null,null,null,null,null,null,null,"MOIS"]
[null,null,null,null,null,null,null,null,null,null,null,null,null,null,null,null,null,null,null,null,10,"Jeune 6-9",null,null,1]
[null,null,"colonne A de la page DONNEES",null,null,"colonne B de la page DONNEES",null,null,null,null,null,null,null,null,null,null,null,null,null,null,20,"Jeune 8-11",null,null,2]
[null,"Type d'épreuve",null,null,"Catégorie d'âge",null,null,null,null,null,null,null,null,null,null,null,null,null,null,null,30,"Jeunes 10-13",null,null,3]
[null,"Aquathlon",50,null,"Distance L",80,null,"Aquathlon","Jeune 6-9","Jeune 8-11","Jeune 10-13","Jeune 12-19","Distance XXS","Distance XS","Distance S","Distance M","Distance L","Distance XL",null,null,40,"Jeune 12-19",null,null,4]
[null,"Bike_and_Run",60,null,"Distance M",70,null,"Cross_Duathlon","Jeune 6-9","Jeune 8-11","Jeune 10-13","Jeune 12-19","Distance XXS","Distance XS","Distance S","Distance M","Distance L","Distance XL",null,null,41,"Distance XXS",null,null,5]
[null,"Cross_Duathlon",40,null,"Distance S",60,null,"Cross_Triathlon","Jeune 6-9","Jeune 8-11","Jeune 10-13","Jeune 12-19","Distance XXS","Distance XS","Distance S","Distance M","Distance L","Distance XL",null,null,50,"Distance XS",null,null,6]
[null,"Cross_Triathlon",20,null,"Distance XL",90,null,"Duathlon","Jeune 6-9","Jeune 8-11","Jeune 10-13","Jeune 12-19","Distance XXS","Distance XS","Distance S","Distance M","Distance L","Distance XL",null,null,60,"Distance S",null,null,7]
[null,"Duathlon",30,null,"Distance XS",50,null,"Duathlon_des_neiges","Distance XS","Distance S","Distance M",null,null,null,null,null,null,null,null,null,70,"Distance M",null,null,8]
[null,"Duathlon_des_neiges",80,null,"Distance XXL",91,null,"Triathlon","Jeune 6-9","Jeune 8-11","Jeune 10-13","Jeune 12-19","Distance XXS","Distance XS","Distance S","Distance M","Distance L","Distance XL","Distance XXL",null,80,"Distance L",null,null,9]
[null,"Raid",90,null,"Jeune 10-13",30,null,"Triathon_des_neiges","Distance XS","Distance S","Distance M",null,null,null,null,null,null,null,null,null,90,"Distance XL",null,null,10]
[null,"Swim_Run",91,null,"Jeune 12-19",40,null,"Swim_Run","Distance XXS","Distance XS","Distance S","Distance M","Distance L","Distance XL",null,null,null,null,null,null,91,"Distance XXL",null,null,11]
[null,"Triathlon",10,null,"Jeune 6-9",10,null,"Cyclathlon_Vetathlon","Jeune 6-9","Jeune 8-11","Jeune 10-13","Jeune 12-19","Distance XXS","Distance XS","Distance S","Distance M","Distance L","Distance XL",null,null,91,"Distance XXL",null,null,12]
[null,"Triathon_des_neiges",70,null,"Jeune 8-11",20,null,"Swim_Bike","Jeune 6-9","Jeune 8-11","Jeune 10-13","Jeune 12-19","Distance XXS","Distance XS","Distance S","Distance M","Distance L","Distance XL"]
[null,"Cyclathlon_Vetathlon",92,null,"Distance XXS",41,null,"Bike_and_Run","Jeune 6-9","Jeune 8-11","Jeune 10-13","Jeune 12-19","Distance XXS","Distance XS","Distance S","Distance M","Distance L"]
[null,"Swim_Bike",93,null,null,null,null,"Raid","Jeune 6-9","Jeune 8-11","Jeune 10-13","Jeune 12-19","Distance XXS","Distance XS","Distance S","Distance M","Distance L","Distance XL","Distance XXL"]